{"text_format":"1","workbook":"xlsx","n_sheets":7,"sheets":["Thông tin","Vật tư","Nhà cung cấp","Nhập liệu","Nhập-Xuất-Tồn","Chi tiết N-X-T","Phiếu Nhập-Xuất "],"not_rendered":{"charts":0,"images":4,"macros":1,"external_links":0,"defined_names":27,"comments":1,"pivot_tables":0},"unopened":[],"bounds":{"document_bytes":16777216,"sheet_cells":100000,"rows_first":2000,"rows_last":500,"rows_between":2000,"halvings":0,"cell_chars":16384,"cell_head_chars":4096},"cells_cut":0,"cells_raw":0,"read":"whole","date_system":"1900"}

{"sheet":"Thông tin","index":0,"n_rows":13,"n_cols":3,"rows_kept":13,"cut":false,"hidden":false,"merged":[]}
[]
[null,"Tên Công ty:","TỔNG CÔNG TY XD CTGT 6 - CÔNG TY CỔ PHẦN"]
[null,"Địa chỉ:","127 Đinh Tiên Hoàng, F3, Q.Bình Thạnh, TP.HCM"]
[null,"Tại kho:","Trạm Trộn BTNN Núi Nhọn"]
[null,"Số điện thoại:","0906690003"]
[null,"Số fax:","0906690003"]
[null,"Mã số thuế:","0906690003"]
[null,"Thủ trưởng đơn vị:","Ngô Ngọc Trung"]
[null,"Người lập biểu:","Nguyễn Phi Long"]
[null,"Thủ kho:","Nguyễn Phi Long"]
[null,"Năm theo dõi:",2014]
[null,"Ngày đầu Báo cáo:","2014-01-01"]
[null,"Ngày cuối Báo cáo:","2014-11-30"]

{"sheet":"Vật tư","index":1,"n_rows":201,"n_cols":9,"rows_kept":201,"cut":false,"hidden":false,"merged":[[4,0,4,8]]}
[{"$f":"tt_Tên_Công_ty","v":"TỔNG CÔNG TY XD CTGT 6 - CÔNG TY CỔ PHẦN"}]
[{"$f":"tt_Địa_chỉ","v":"127 Đinh Tiên Hoàng, F3, Q.Bình Thạnh, TP.HCM"}]
[{"$f":"\"Tên kho: \"&tt_Tên_Kho","v":"Tên kho: Trạm Trộn BTNN Núi Nhọn"}]
[]
["VẬT TƯ HÀNG HÓA"]
[]
["STT","Mã vật tư","Tên vật tư","ĐVT","Số lượng\nđầu kỳ","Nhập \ntrong kỳ","Xuất \ntrong kỳ","Tồn \ncuối kỳ","Ghi chú"]
["stt","mavt","tenvt","dvt","sldauky","slnhap","slxuat","slton","ghichu"]
[1,"ND-001","Nhựa đường Puma","Tấn",2,{"$f":"SUMIFS('Nhập liệu'!$H$10:$H$1002,'Nhập liệu'!$E$10:$E$1002,'Vật tư'!$B9,'Nhập liệu'!$C$10:$C$1002,\">=\"&'Thông tin'!$C$12,'Nhập liệu'!$C$10:$C$1002,\"<=\"&'Thông tin'!$C$13)","v":52880},{"$f":"SUMIFS('Nhập liệu'!$I$10:$I$1002,'Nhập liệu'!$E$10:$E$1002,'Vật tư'!$B9,'Nhập liệu'!$C$10:$C$1002,\">=\"&'Thông tin'!$C$12,'Nhập liệu'!$C$10:$C$1002,\"<=\"&'Thông tin'!$C$13)","v":44993},{"$f":"F9-G9","v":7887}]
[2,"FO-001","Dầu FO","Lít",2,{"$f":"SUMIFS('Nhập liệu'!$H$10:$H$1002,'Nhập liệu'!$E$10:$E$1002,'Vật tư'!$B10,'Nhập liệu'!$C$10:$C$1002,\">=\"&'Thông tin'!$C$12,'Nhập liệu'!$C$10:$C$1002,\"<=\"&'Thông tin'!$C$13)","v":29942},{"$f":"SUMIFS('Nhập liệu'!$I$10:$I$1002,'Nhập liệu'!$E$10:$E$1002,'Vật tư'!$B10,'Nhập liệu'!$C$10:$C$1002,\">=\"&'Thông tin'!$C$12,'Nhập liệu'!$C$10:$C$1002,\"<=\"&'Thông tin'!$C$13)","v":18999},{"$f":"F10-G10","v":10943}]
[3,"BK-001","Bột Khoáng Holeim","Tấn",2,{"$f":"SUMIFS('Nhập liệu'!$H$10:$H$1002,'Nhập liệu'!$E$10:$E$1002,'Vật tư'!$B11,'Nhập liệu'!$C$10:$C$1002,\">=\"&'Thông tin'!$C$12,'Nhập liệu'!$C$10:$C$1002,\"<=\"&'Thông tin'!$C$13)","v":40},{"$f":"SUMIFS('Nhập liệu'!$I$10:$I$1002,'Nhập liệu'!$E$10:$E$1002,'Vật tư'!$B11,'Nhập liệu'!$C$10:$C$1002,\">=\"&'Thông tin'!$C$12,'Nhập liệu'!$C$10:$C$1002,\"<=\"&'Thông tin'!$C$13)","v":69.5},-29.5]
[4,"CA-001","Cát","M3",2,{"$f":"SUMIFS('Nhập liệu'!$H$10:$H$1002,'Nhập liệu'!$E$10:$E$1002,'Vật tư'!$B12,'Nhập liệu'!$C$10:$C$1002,\">=\"&'Thông tin'!$C$12,'Nhập liệu'!$C$10:$C$1002,\"<=\"&'Thông tin'!$C$13)","v":311},{"$f":"SUMIFS('Nhập liệu'!$I$10:$I$1002,'Nhập liệu'!$E$10:$E$1002,'Vật tư'!$B12,'Nhập liệu'!$C$10:$C$1002,\">=\"&'Thông tin'!$C$12,'Nhập liệu'!$C$10:$C$1002,\"<=\"&'Thông tin'!$C$13)","v":183},128]
[null,null,null,null,null,{"$f":"SUMIFS('Nhập liệu'!$H$10:$H$1002,'Nhập liệu'!$E$10:$E$1002,'Vật tư'!$B13,'Nhập liệu'!$C$10:$C$1002,\">=\"&'Thông tin'!$C$12,'Nhập liệu'!$C$10:$C$1002,\"<=\"&'Thông tin'!$C$13)","v":0},{"$f":"SUMIFS('Nhập liệu'!$I$10:$I$1002,'Nhập liệu'!$E$10:$E$1002,'Vật tư'!$B13,'Nhập liệu'!$C$10:$C$1002,\">=\"&'Thông tin'!$C$12,'Nhập liệu'!$C$10:$C$1002,\"<=\"&'Thông tin'!$C$13)","v":0},0]
[null,null,null,null,null,{"$f":"SUMIFS('Nhập liệu'!$H$10:$H$1002,'Nhập liệu'!$E$10:$E$1002,'Vật tư'!$B14,'Nhập liệu'!$C$10:$C$1002,\">=\"&'Thông tin'!$C$12,'Nhập liệu'!$C$10:$C$1002,\"<=\"&'Thông tin'!$C$13)","v":0},{"$f":"SUMIFS('Nhập liệu'!$I$10:$I$1002,'Nhập liệu'!$E$10:$E$1002,'Vật tư'!$B14,'Nhập liệu'!$C$10:$C$1002,\">=\"&'Thông tin'!$C$12,'Nhập liệu'!$C$10:$C$1002,\"<=\"&'Thông tin'!$C$13)","v":0},0]
[null,null,null,null,null,{"$f":"SUMIFS('Nhập liệu'!$H$10:$H$1002,'Nhập liệu'!$E$10:$E$1002,'Vật tư'!$B15,'Nhập liệu'!$C$10:$C$1002,\">=\"&'Thông tin'!$C$12,'Nhập liệu'!$C$10:$C$1002,\"<=\"&'Thông tin'!$C$13)","v":0},{"$f":"SUMIFS('Nhập liệu'!$I$10:$I$1002,'Nhập liệu'!$E$10:$E$1002,'Vật tư'!$B15,'Nhập liệu'!$C$10:$C$1002,\">=\"&'Thông tin'!$C$12,'Nhập liệu'!$C$10:$C$1002,\"<=\"&'Thông tin'!$C$13)","v":0},0]
[null,null,null,null,null,{"$f":"SUMIFS('Nhập liệu'!$H$10:$H$1002,'Nhập liệu'!$E$10:$E$1002,'Vật tư'!$B16,'Nhập liệu'!$C$10:$C$1002,\">=\"&'Thông tin'!$C$12,'Nhập liệu'!$C$10:$C$1002,\"<=\"&'Thông tin'!$C$13)","v":0},{"$f":"SUMIFS('Nhập liệu'!$I$10:$I$1002,'Nhập liệu'!$E$10:$E$1002,'Vật tư'!$B16,'Nhập liệu'!$C$10:$C$1002,\">=\"&'Thông tin'!$C$12,'Nhập liệu'!$C$10:$C$1002,\"<=\"&'Thông tin'!$C$13)","v":0},0]
[null,null,null,null,null,{"$f":"SUMIFS('Nhập liệu'!$H$10:$H$1002,'Nhập liệu'!$E$10:$E$1002,'Vật tư'!$B17,'Nhập liệu'!$C$10:$C$1002,\">=\"&'Thông tin'!$C$12,'Nhập liệu'!$C$10:$C$1002,\"<=\"&'Thông tin'!$C$13)","v":0},{"$f":"SUMIFS('Nhập liệu'!$I$10:$I$1002,'Nhập liệu'!$E$10:$E$1002,'Vật tư'!$B17,'Nhập liệu'!$C$10:$C$1002,\">=\"&'Thông tin'!$C$12,'Nhập liệu'!$C$10:$C$1002,\"<=\"&'Thông tin'!$C$13)","v":0},0]
[null,null,null,null,null,{"$f":"SUMIFS('Nhập liệu'!$H$10:$H$1002,'Nhập liệu'!$E$10:$E$1002,'Vật tư'!$B18,'Nhập liệu'!$C$10:$C$1002,\">=\"&'Thông tin'!$C$12,'Nhập liệu'!$C$10:$C$1002,\"<=\"&'Thông tin'!$C$13)","v":0},{"$f":"SUMIFS('Nhập liệu'!$I$10:$I$1002,'Nhập liệu'!$E$10:$E$1002,'Vật tư'!$B18,'Nhập liệu'!$C$10:$C$1002,\">=\"&'Thông tin'!$C$12,'Nhập liệu'!$C$10:$C$1002,\"<=\"&'Thông tin'!$C$13)","v":0},0]
[null,null,null,null,null,{"$f":"SUMIFS('Nhập liệu'!$H$10:$H$1002,'Nhập liệu'!$E$10:$E$1002,'Vật tư'!$B19,'Nhập liệu'!$C$10:$C$1002,\">=\"&'Thông tin'!$C$12,'Nhập liệu'!$C$10:$C$1002,\"<=\"&'Thông tin'!$C$13)","v":0},{"$f":"SUMIFS('Nhập liệu'!$I$10:$I$1002,'Nhập liệu'!$E$10:$E$1002,'Vật tư'!$B19,'Nhập liệu'!$C$10:$C$1002,\">=\"&'Thông tin'!$C$12,'Nhập liệu'!$C$10:$C$1002,\"<=\"&'Thông tin'!$C$13)","v":0},0]
[null,null,null,null,null,{"$f":"SUMIFS('Nhập liệu'!$H$10:$H$1002,'Nhập liệu'!$E$10:$E$1002,'Vật tư'!$B20,'Nhập liệu'!$C$10:$C$1002,\">=\"&'Thông tin'!$C$12,'Nhập liệu'!$C$10:$C$1002,\"<=\"&'Thông tin'!$C$13)","v":0},{"$f":"SUMIFS('Nhập liệu'!$I$10:$I$1002,'Nhập liệu'!$E$10:$E$1002,'Vật tư'!$B20,'Nhập liệu'!$C$10:$C$1002,\">=\"&'Thông tin'!$C$12,'Nhập liệu'!$C$10:$C$1002,\"<=\"&'Thông tin'!$C$13)","v":0},0]
[null,null,null,null,null,{"$f":"SUMIFS('Nhập liệu'!$H$10:$H$1002,'Nhập liệu'!$E$10:$E$1002,'Vật tư'!$B21,'Nhập liệu'!$C$10:$C$1002,\">=\"&'Thông tin'!$C$12,'Nhập liệu'!$C$10:$C$1002,\"<=\"&'Thông tin'!$C$13)","v":0},{"$f":"SUMIFS('Nhập liệu'!$I$10:$I$1002,'Nhập liệu'!$E$10:$E$1002,'Vật tư'!$B21,'Nhập liệu'!$C$10:$C$1002,\">=\"&'Thông tin'!$C$12,'Nhập liệu'!$C$10:$C$1002,\"<=\"&'Thông tin'!$C$13)","v":0},0]
[null,null,null,null,null,{"$f":"SUMIFS('Nhập liệu'!$H$10:$H$1002,'Nhập liệu'!$E$10:$E$1002,'Vật tư'!$B22,'Nhập liệu'!$C$10:$C$1002,\">=\"&'Thông tin'!$C$12,'Nhập liệu'!$C$10:$C$1002,\"<=\"&'Thông tin'!$C$13)","v":0},{"$f":"SUMIFS('Nhập liệu'!$I$10:$I$1002,'Nhập liệu'!$E$10:$E$1002,'Vật tư'!$B22,'Nhập liệu'!$C$10:$C$1002,\">=\"&'Thông tin'!$C$12,'Nhập liệu'!$C$10:$C$1002,\"<=\"&'Thông tin'!$C$13)","v":0},0]
[null,null,null,null,null,{"$f":"SUMIFS('Nhập liệu'!$H$10:$H$1002,'Nhập liệu'!$E$10:$E$1002,'Vật tư'!$B23,'Nhập liệu'!$C$10:$C$1002,\">=\"&'Thông tin'!$C$12,'Nhập liệu'!$C$10:$C$1002,\"<=\"&'Thông tin'!$C$13)","v":0},{"$f":"SUMIFS('Nhập liệu'!$I$10:$I$1002,'Nhập liệu'!$E$10:$E$1002,'Vật tư'!$B23,'Nhập liệu'!$C$10:$C$1002,\">=\"&'Thông tin'!$C$12,'Nhập liệu'!$C$10:$C$1002,\"<=\"&'Thông tin'!$C$13)","v":0},0]
[null,null,null,null,null,{"$f":"SUMIFS('Nhập liệu'!$H$10:$H$1002,'Nhập liệu'!$E$10:$E$1002,'Vật tư'!$B24,'Nhập liệu'!$C$10:$C$1002,\">=\"&'Thông tin'!$C$12,'Nhập liệu'!$C$10:$C$1002,\"<=\"&'Thông tin'!$C$13)","v":0},{"$f":"SUMIFS('Nhập liệu'!$I$10:$I$1002,'Nhập liệu'!$E$10:$E$1002,'Vật tư'!$B24,'Nhập liệu'!$C$10:$C$1002,\">=\"&'Thông tin'!$C$12,'Nhập liệu'!$C$10:$C$1002,\"<=\"&'Thông tin'!$C$13)","v":0},0]
[null,null,null,null,null,{"$f":"SUMIFS('Nhập liệu'!$H$10:$H$1002,'Nhập liệu'!$E$10:$E$1002,'Vật tư'!$B25,'Nhập liệu'!$C$10:$C$1002,\">=\"&'Thông tin'!$C$12,'Nhập liệu'!$C$10:$C$1002,\"<=\"&'Thông tin'!$C$13)","v":0},{"$f":"SUMIFS('Nhập liệu'!$I$10:$I$1002,'Nhập liệu'!$E$10:$E$1002,'Vật tư'!$B25,'Nhập liệu'!$C$10:$C$1002,\">=\"&'Thông tin'!$C$12,'Nhập liệu'!$C$10:$C$1002,\"<=\"&'Thông tin'!$C$13)","v":0},0]
[null,null,null,null,null,{"$f":"SUMIFS('Nhập liệu'!$H$10:$H$1002,'Nhập liệu'!$E$10:$E$1002,'Vật tư'!$B26,'Nhập liệu'!$C$10:$C$1002,\">=\"&'Thông tin'!$C$12,'Nhập liệu'!$C$10:$C$1002,\"<=\"&'Thông tin'!$C$13)","v":0},{"$f":"SUMIFS('Nhập liệu'!$I$10:$I$1002,'Nhập liệu'!$E$10:$E$1002,'Vật tư'!$B26,'Nhập liệu'!$C$10:$C$1002,\">=\"&'Thông tin'!$C$12,'Nhập liệu'!$C$10:$C$1002,\"<=\"&'Thông tin'!$C$13)","v":0},0]
[null,null,null,null,null,{"$f":"SUMIFS('Nhập liệu'!$H$10:$H$1002,'Nhập liệu'!$E$10:$E$1002,'Vật tư'!$B27,'Nhập liệu'!$C$10:$C$1002,\">=\"&'Thông tin'!$C$12,'Nhập liệu'!$C$10:$C$1002,\"<=\"&'Thông tin'!$C$13)","v":0},{"$f":"SUMIFS('Nhập liệu'!$I$10:$I$1002,'Nhập liệu'!$E$10:$E$1002,'Vật tư'!$B27,'Nhập liệu'!$C$10:$C$1002,\">=\"&'Thông tin'!$C$12,'Nhập liệu'!$C$10:$C$1002,\"<=\"&'Thông tin'!$C$13)","v":0},0]
[null,null,null,null,null,{"$f":"SUMIFS('Nhập liệu'!$H$10:$H$1002,'Nhập liệu'!$E$10:$E$1002,'Vật tư'!$B28,'Nhập liệu'!$C$10:$C$1002,\">=\"&'Thông tin'!$C$12,'Nhập liệu'!$C$10:$C$1002,\"<=\"&'Thông tin'!$C$13)","v":0},{"$f":"SUMIFS('Nhập liệu'!$I$10:$I$1002,'Nhập liệu'!$E$10:$E$1002,'Vật tư'!$B28,'Nhập liệu'!$C$10:$C$1002,\">=\"&'Thông tin'!$C$12,'Nhập liệu'!$C$10:$C$1002,\"<=\"&'Thông tin'!$C$13)","v":0},0]
[null,null,null,null,null,{"$f":"SUMIFS('Nhập liệu'!$H$10:$H$1002,'Nhập liệu'!$E$10:$E$1002,'Vật tư'!$B29,'Nhập liệu'!$C$10:$C$1002,\">=\"&'Thông tin'!$C$12,'Nhập liệu'!$C$10:$C$1002,\"<=\"&'Thông tin'!$C$13)","v":0},{"$f":"SUMIFS('Nhập liệu'!$I$10:$I$1002,'Nhập liệu'!$E$10:$E$1002,'Vật tư'!$B29,'Nhập liệu'!$C$10:$C$1002,\">=\"&'Thông tin'!$C$12,'Nhập liệu'!$C$10:$C$1002,\"<=\"&'Thông tin'!$C$13)","v":0},0]
[null,null,null,null,null,{"$f":"SUMIFS('Nhập liệu'!$H$10:$H$1002,'Nhập liệu'!$E$10:$E$1002,'Vật tư'!$B30,'Nhập liệu'!$C$10:$C$1002,\">=\"&'Thông tin'!$C$12,'Nhập liệu'!$C$10:$C$1002,\"<=\"&'Thông tin'!$C$13)","v":0},{"$f":"SUMIFS('Nhập liệu'!$I$10:$I$1002,'Nhập liệu'!$E$10:$E$1002,'Vật tư'!$B30,'Nhập liệu'!$C$10:$C$1002,\">=\"&'Thông tin'!$C$12,'Nhập liệu'!$C$10:$C$1002,\"<=\"&'Thông tin'!$C$13)","v":0},0]
[null,null,null,null,null,{"$f":"SUMIFS('Nhập liệu'!$H$10:$H$1002,'Nhập liệu'!$E$10:$E$1002,'Vật tư'!$B31,'Nhập liệu'!$C$10:$C$1002,\">=\"&'Thông tin'!$C$12,'Nhập liệu'!$C$10:$C$1002,\"<=\"&'Thông tin'!$C$13)","v":0},{"$f":"SUMIFS('Nhập liệu'!$I$10:$I$1002,'Nhập liệu'!$E$10:$E$1002,'Vật tư'!$B31,'Nhập liệu'!$C$10:$C$1002,\">=\"&'Thông tin'!$C$12,'Nhập liệu'!$C$10:$C$1002,\"<=\"&'Thông tin'!$C$13)","v":0},0]
[null,null,null,null,null,{"$f":"SUMIFS('Nhập liệu'!$H$10:$H$1002,'Nhập liệu'!$E$10:$E$1002,'Vật tư'!$B32,'Nhập liệu'!$C$10:$C$1002,\">=\"&'Thông tin'!$C$12,'Nhập liệu'!$C$10:$C$1002,\"<=\"&'Thông tin'!$C$13)","v":0},{"$f":"SUMIFS('Nhập liệu'!$I$10:$I$1002,'Nhập liệu'!$E$10:$E$1002,'Vật tư'!$B32,'Nhập liệu'!$C$10:$C$1002,\">=\"&'Thông tin'!$C$12,'Nhập liệu'!$C$10:$C$1002,\"<=\"&'Thông tin'!$C$13)","v":0},0]
[null,null,null,null,null,{"$f":"SUMIFS('Nhập liệu'!$H$10:$H$1002,'Nhập liệu'!$E$10:$E$1002,'Vật tư'!$B33,'Nhập liệu'!$C$10:$C$1002,\">=\"&'Thông tin'!$C$12,'Nhập liệu'!$C$10:$C$1002,\"<=\"&'Thông tin'!$C$13)","v":0},{"$f":"SUMIFS('Nhập liệu'!$I$10:$I$1002,'Nhập liệu'!$E$10:$E$1002,'Vật tư'!$B33,'Nhập liệu'!$C$10:$C$1002,\">=\"&'Thông tin'!$C$12,'Nhập liệu'!$C$10:$C$1002,\"<=\"&'Thông tin'!$C$13)","v":0},0]
[null,null,null,null,null,{"$f":"SUMIFS('Nhập liệu'!$H$10:$H$1002,'Nhập liệu'!$E$10:$E$1002,'Vật tư'!$B34,'Nhập liệu'!$C$10:$C$1002,\">=\"&'Thông tin'!$C$12,'Nhập liệu'!$C$10:$C$1002,\"<=\"&'Thông tin'!$C$13)","v":0},{"$f":"SUMIFS('Nhập liệu'!$I$10:$I$1002,'Nhập liệu'!$E$10:$E$1002,'Vật tư'!$B34,'Nhập liệu'!$C$10:$C$1002,\">=\"&'Thông tin'!$C$12,'Nhập liệu'!$C$10:$C$1002,\"<=\"&'Thông tin'!$C$13)","v":0},0]
[null,null,null,null,null,{"$f":"SUMIFS('Nhập liệu'!$H$10:$H$1002,'Nhập liệu'!$E$10:$E$1002,'Vật tư'!$B35,'Nhập liệu'!$C$10:$C$1002,\">=\"&'Thông tin'!$C$12,'Nhập liệu'!$C$10:$C$1002,\"<=\"&'Thông tin'!$C$13)","v":0},{"$f":"SUMIFS('Nhập liệu'!$I$10:$I$1002,'Nhập liệu'!$E$10:$E$1002,'Vật tư'!$B35,'Nhập liệu'!$C$10:$C$1002,\">=\"&'Thông tin'!$C$12,'Nhập liệu'!$C$10:$C$1002,\"<=\"&'Thông tin'!$C$13)","v":0},0]
[null,null,null,null,null,{"$f":"SUMIFS('Nhập liệu'!$H$10:$H$1002,'Nhập liệu'!$E$10:$E$1002,'Vật tư'!$B36,'Nhập liệu'!$C$10:$C$1002,\">=\"&'Thông tin'!$C$12,'Nhập liệu'!$C$10:$C$1002,\"<=\"&'Thông tin'!$C$13)","v":0},{"$f":"SUMIFS('Nhập liệu'!$I$10:$I$1002,'Nhập liệu'!$E$10:$E$1002,'Vật tư'!$B36,'Nhập liệu'!$C$10:$C$1002,\">=\"&'Thông tin'!$C$12,'Nhập liệu'!$C$10:$C$1002,\"<=\"&'Thông tin'!$C$13)","v":0},0]
[null,null,null,null,null,{"$f":"SUMIFS('Nhập liệu'!$H$10:$H$1002,'Nhập liệu'!$E$10:$E$1002,'Vật tư'!$B37,'Nhập liệu'!$C$10:$C$1002,\">=\"&'Thông tin'!$C$12,'Nhập liệu'!$C$10:$C$1002,\"<=\"&'Thông tin'!$C$13)","v":0},{"$f":"SUMIFS('Nhập liệu'!$I$10:$I$1002,'Nhập liệu'!$E$10:$E$1002,'Vật tư'!$B37,'Nhập liệu'!$C$10:$C$1002,\">=\"&'Thông tin'!$C$12,'Nhập liệu'!$C$10:$C$1002,\"<=\"&'Thông tin'!$C$13)","v":0},0]
[null,null,null,null,null,{"$f":"SUMIFS('Nhập liệu'!$H$10:$H$1002,'Nhập liệu'!$E$10:$E$1002,'Vật tư'!$B38,'Nhập liệu'!$C$10:$C$1002,\">=\"&'Thông tin'!$C$12,'Nhập liệu'!$C$10:$C$1002,\"<=\"&'Thông tin'!$C$13)","v":0},{"$f":"SUMIFS('Nhập liệu'!$I$10:$I$1002,'Nhập liệu'!$E$10:$E$1002,'Vật tư'!$B38,'Nhập liệu'!$C$10:$C$1002,\">=\"&'Thông tin'!$C$12,'Nhập liệu'!$C$10:$C$1002,\"<=\"&'Thông tin'!$C$13)","v":0},0]
[null,null,null,null,null,{"$f":"SUMIFS('Nhập liệu'!$H$10:$H$1002,'Nhập liệu'!$E$10:$E$1002,'Vật tư'!$B39,'Nhập liệu'!$C$10:$C$1002,\">=\"&'Thông tin'!$C$12,'Nhập liệu'!$C$10:$C$1002,\"<=\"&'Thông tin'!$C$13)","v":0},{"$f":"SUMIFS('Nhập liệu'!$I$10:$I$1002,'Nhập liệu'!$E$10:$E$1002,'Vật tư'!$B39,'Nhập liệu'!$C$10:$C$1002,\">=\"&'Thông tin'!$C$12,'Nhập liệu'!$C$10:$C$1002,\"<=\"&'Thông tin'!$C$13)","v":0},0]
[{"$f":"+IF(OR($A39=\"\",$B40=\"\"),\"\",$A39+1)","v":""},null,null,null,null,{"$f":"SUMIFS('Nhập liệu'!$H$10:$H$1002,'Nhập liệu'!$E$10:$E$1002,'Vật tư'!$B40,'Nhập liệu'!$C$10:$C$1002,\">=\"&'Thông tin'!$C$12,'Nhập liệu'!$C$10:$C$1002,\"<=\"&'Thông tin'!$C$13)","v":0},{"$f":"SUMIFS('Nhập liệu'!$I$10:$I$1002,'Nhập liệu'!$E$10:$E$1002,'Vật tư'!$B40,'Nhập liệu'!$C$10:$C$1002,\">=\"&'Thông tin'!$C$12,'Nhập liệu'!$C$10:$C$1002,\"<=\"&'Thông tin'!$C$13)","v":0},0]
["",null,null,null,null,{"$f":"SUMIFS('Nhập liệu'!$H$10:$H$1002,'Nhập liệu'!$E$10:$E$1002,'Vật tư'!$B41,'Nhập liệu'!$C$10:$C$1002,\">=\"&'Thông tin'!$C$12,'Nhập liệu'!$C$10:$C$1002,\"<=\"&'Thông tin'!$C$13)","v":0},{"$f":"SUMIFS('Nhập liệu'!$I$10:$I$1002,'Nhập liệu'!$E$10:$E$1002,'Vật tư'!$B41,'Nhập liệu'!$C$10:$C$1002,\">=\"&'Thông tin'!$C$12,'Nhập liệu'!$C$10:$C$1002,\"<=\"&'Thông tin'!$C$13)","v":0},0]
["",null,null,null,null,{"$f":"SUMIFS('Nhập liệu'!$H$10:$H$1002,'Nhập liệu'!$E$10:$E$1002,'Vật tư'!$B42,'Nhập liệu'!$C$10:$C$1002,\">=\"&'Thông tin'!$C$12,'Nhập liệu'!$C$10:$C$1002,\"<=\"&'Thông tin'!$C$13)","v":0},{"$f":"SUMIFS('Nhập liệu'!$I$10:$I$1002,'Nhập liệu'!$E$10:$E$1002,'Vật tư'!$B42,'Nhập liệu'!$C$10:$C$1002,\">=\"&'Thông tin'!$C$12,'Nhập liệu'!$C$10:$C$1002,\"<=\"&'Thông tin'!$C$13)","v":0},0]
["",null,null,null,null,{"$f":"SUMIFS('Nhập liệu'!$H$10:$H$1002,'Nhập liệu'!$E$10:$E$1002,'Vật tư'!$B43,'Nhập liệu'!$C$10:$C$1002,\">=\"&'Thông tin'!$C$12,'Nhập liệu'!$C$10:$C$1002,\"<=\"&'Thông tin'!$C$13)","v":0},{"$f":"SUMIFS('Nhập liệu'!$I$10:$I$1002,'Nhập liệu'!$E$10:$E$1002,'Vật tư'!$B43,'Nhập liệu'!$C$10:$C$1002,\">=\"&'Thông tin'!$C$12,'Nhập liệu'!$C$10:$C$1002,\"<=\"&'Thông tin'!$C$13)","v":0},0]
["",null,null,null,null,{"$f":"SUMIFS('Nhập liệu'!$H$10:$H$1002,'Nhập liệu'!$E$10:$E$1002,'Vật tư'!$B44,'Nhập liệu'!$C$10:$C$1002,\">=\"&'Thông tin'!$C$12,'Nhập liệu'!$C$10:$C$1002,\"<=\"&'Thông tin'!$C$13)","v":0},{"$f":"SUMIFS('Nhập liệu'!$I$10:$I$1002,'Nhập liệu'!$E$10:$E$1002,'Vật tư'!$B44,'Nhập liệu'!$C$10:$C$1002,\">=\"&'Thông tin'!$C$12,'Nhập liệu'!$C$10:$C$1002,\"<=\"&'Thông tin'!$C$13)","v":0},0]
["",null,null,null,null,{"$f":"SUMIFS('Nhập liệu'!$H$10:$H$1002,'Nhập liệu'!$E$10:$E$1002,'Vật tư'!$B45,'Nhập liệu'!$C$10:$C$1002,\">=\"&'Thông tin'!$C$12,'Nhập liệu'!$C$10:$C$1002,\"<=\"&'Thông tin'!$C$13)","v":0},{"$f":"SUMIFS('Nhập liệu'!$I$10:$I$1002,'Nhập liệu'!$E$10:$E$1002,'Vật tư'!$B45,'Nhập liệu'!$C$10:$C$1002,\">=\"&'Thông tin'!$C$12,'Nhập liệu'!$C$10:$C$1002,\"<=\"&'Thông tin'!$C$13)","v":0},0]
["",null,null,null,null,{"$f":"SUMIFS('Nhập liệu'!$H$10:$H$1002,'Nhập liệu'!$E$10:$E$1002,'Vật tư'!$B46,'Nhập liệu'!$C$10:$C$1002,\">=\"&'Thông tin'!$C$12,'Nhập liệu'!$C$10:$C$1002,\"<=\"&'Thông tin'!$C$13)","v":0},{"$f":"SUMIFS('Nhập liệu'!$I$10:$I$1002,'Nhập liệu'!$E$10:$E$1002,'Vật tư'!$B46,'Nhập liệu'!$C$10:$C$1002,\">=\"&'Thông tin'!$C$12,'Nhập liệu'!$C$10:$C$1002,\"<=\"&'Thông tin'!$C$13)","v":0},0]
["",null,null,null,null,{"$f":"SUMIFS('Nhập liệu'!$H$10:$H$1002,'Nhập liệu'!$E$10:$E$1002,'Vật tư'!$B47,'Nhập liệu'!$C$10:$C$1002,\">=\"&'Thông tin'!$C$12,'Nhập liệu'!$C$10:$C$1002,\"<=\"&'Thông tin'!$C$13)","v":0},{"$f":"SUMIFS('Nhập liệu'!$I$10:$I$1002,'Nhập liệu'!$E$10:$E$1002,'Vật tư'!$B47,'Nhập liệu'!$C$10:$C$1002,\">=\"&'Thông tin'!$C$12,'Nhập liệu'!$C$10:$C$1002,\"<=\"&'Thông tin'!$C$13)","v":0},0]
["",null,null,null,null,{"$f":"SUMIFS('Nhập liệu'!$H$10:$H$1002,'Nhập liệu'!$E$10:$E$1002,'Vật tư'!$B48,'Nhập liệu'!$C$10:$C$1002,\">=\"&'Thông tin'!$C$12,'Nhập liệu'!$C$10:$C$1002,\"<=\"&'Thông tin'!$C$13)","v":0},{"$f":"SUMIFS('Nhập liệu'!$I$10:$I$1002,'Nhập liệu'!$E$10:$E$1002,'Vật tư'!$B48,'Nhập liệu'!$C$10:$C$1002,\">=\"&'Thông tin'!$C$12,'Nhập liệu'!$C$10:$C$1002,\"<=\"&'Thông tin'!$C$13)","v":0},0]
["",null,null,null,null,{"$f":"SUMIFS('Nhập liệu'!$H$10:$H$1002,'Nhập liệu'!$E$10:$E$1002,'Vật tư'!$B49,'Nhập liệu'!$C$10:$C$1002,\">=\"&'Thông tin'!$C$12,'Nhập liệu'!$C$10:$C$1002,\"<=\"&'Thông tin'!$C$13)","v":0},{"$f":"SUMIFS('Nhập liệu'!$I$10:$I$1002,'Nhập liệu'!$E$10:$E$1002,'Vật tư'!$B49,'Nhập liệu'!$C$10:$C$1002,\">=\"&'Thông tin'!$C$12,'Nhập liệu'!$C$10:$C$1002,\"<=\"&'Thông tin'!$C$13)","v":0},0]
["",null,null,null,null,{"$f":"SUMIFS('Nhập liệu'!$H$10:$H$1002,'Nhập liệu'!$E$10:$E$1002,'Vật tư'!$B50,'Nhập liệu'!$C$10:$C$1002,\">=\"&'Thông tin'!$C$12,'Nhập liệu'!$C$10:$C$1002,\"<=\"&'Thông tin'!$C$13)","v":0},{"$f":"SUMIFS('Nhập liệu'!$I$10:$I$1002,'Nhập liệu'!$E$10:$E$1002,'Vật tư'!$B50,'Nhập liệu'!$C$10:$C$1002,\">=\"&'Thông tin'!$C$12,'Nhập liệu'!$C$10:$C$1002,\"<=\"&'Thông tin'!$C$13)","v":0},0]
["",null,null,null,null,{"$f":"SUMIFS('Nhập liệu'!$H$10:$H$1002,'Nhập liệu'!$E$10:$E$1002,'Vật tư'!$B51,'Nhập liệu'!$C$10:$C$1002,\">=\"&'Thông tin'!$C$12,'Nhập liệu'!$C$10:$C$1002,\"<=\"&'Thông tin'!$C$13)","v":0},{"$f":"SUMIFS('Nhập liệu'!$I$10:$I$1002,'Nhập liệu'!$E$10:$E$1002,'Vật tư'!$B51,'Nhập liệu'!$C$10:$C$1002,\">=\"&'Thông tin'!$C$12,'Nhập liệu'!$C$10:$C$1002,\"<=\"&'Thông tin'!$C$13)","v":0},0]
["",null,null,null,null,{"$f":"SUMIFS('Nhập liệu'!$H$10:$H$1002,'Nhập liệu'!$E$10:$E$1002,'Vật tư'!$B52,'Nhập liệu'!$C$10:$C$1002,\">=\"&'Thông tin'!$C$12,'Nhập liệu'!$C$10:$C$1002,\"<=\"&'Thông tin'!$C$13)","v":0},{"$f":"SUMIFS('Nhập liệu'!$I$10:$I$1002,'Nhập liệu'!$E$10:$E$1002,'Vật tư'!$B52,'Nhập liệu'!$C$10:$C$1002,\">=\"&'Thông tin'!$C$12,'Nhập liệu'!$C$10:$C$1002,\"<=\"&'Thông tin'!$C$13)","v":0},0]
["",null,null,null,null,{"$f":"SUMIFS('Nhập liệu'!$H$10:$H$1002,'Nhập liệu'!$E$10:$E$1002,'Vật tư'!$B53,'Nhập liệu'!$C$10:$C$1002,\">=\"&'Thông tin'!$C$12,'Nhập liệu'!$C$10:$C$1002,\"<=\"&'Thông tin'!$C$13)","v":0},{"$f":"SUMIFS('Nhập liệu'!$I$10:$I$1002,'Nhập liệu'!$E$10:$E$1002,'Vật tư'!$B53,'Nhập liệu'!$C$10:$C$1002,\">=\"&'Thông tin'!$C$12,'Nhập liệu'!$C$10:$C$1002,\"<=\"&'Thông tin'!$C$13)","v":0},0]
["",null,null,null,null,{"$f":"SUMIFS('Nhập liệu'!$H$10:$H$1002,'Nhập liệu'!$E$10:$E$1002,'Vật tư'!$B54,'Nhập liệu'!$C$10:$C$1002,\">=\"&'Thông tin'!$C$12,'Nhập liệu'!$C$10:$C$1002,\"<=\"&'Thông tin'!$C$13)","v":0},{"$f":"SUMIFS('Nhập liệu'!$I$10:$I$1002,'Nhập liệu'!$E$10:$E$1002,'Vật tư'!$B54,'Nhập liệu'!$C$10:$C$1002,\">=\"&'Thông tin'!$C$12,'Nhập liệu'!$C$10:$C$1002,\"<=\"&'Thông tin'!$C$13)","v":0},0]
["",null,null,null,null,{"$f":"SUMIFS('Nhập liệu'!$H$10:$H$1002,'Nhập liệu'!$E$10:$E$1002,'Vật tư'!$B55,'Nhập liệu'!$C$10:$C$1002,\">=\"&'Thông tin'!$C$12,'Nhập liệu'!$C$10:$C$1002,\"<=\"&'Thông tin'!$C$13)","v":0},{"$f":"SUMIFS('Nhập liệu'!$I$10:$I$1002,'Nhập liệu'!$E$10:$E$1002,'Vật tư'!$B55,'Nhập liệu'!$C$10:$C$1002,\">=\"&'Thông tin'!$C$12,'Nhập liệu'!$C$10:$C$1002,\"<=\"&'Thông tin'!$C$13)","v":0},0]
["",null,null,null,null,{"$f":"SUMIFS('Nhập liệu'!$H$10:$H$1002,'Nhập liệu'!$E$10:$E$1002,'Vật tư'!$B56,'Nhập liệu'!$C$10:$C$1002,\">=\"&'Thông tin'!$C$12,'Nhập liệu'!$C$10:$C$1002,\"<=\"&'Thông tin'!$C$13)","v":0},{"$f":"SUMIFS('Nhập liệu'!$I$10:$I$1002,'Nhập liệu'!$E$10:$E$1002,'Vật tư'!$B56,'Nhập liệu'!$C$10:$C$1002,\">=\"&'Thông tin'!$C$12,'Nhập liệu'!$C$10:$C$1002,\"<=\"&'Thông tin'!$C$13)","v":0},0]
["",null,null,null,null,{"$f":"SUMIFS('Nhập liệu'!$H$10:$H$1002,'Nhập liệu'!$E$10:$E$1002,'Vật tư'!$B57,'Nhập liệu'!$C$10:$C$1002,\">=\"&'Thông tin'!$C$12,'Nhập liệu'!$C$10:$C$1002,\"<=\"&'Thông tin'!$C$13)","v":0},{"$f":"SUMIFS('Nhập liệu'!$I$10:$I$1002,'Nhập liệu'!$E$10:$E$1002,'Vật tư'!$B57,'Nhập liệu'!$C$10:$C$1002,\">=\"&'Thông tin'!$C$12,'Nhập liệu'!$C$10:$C$1002,\"<=\"&'Thông tin'!$C$13)","v":0},0]
["",null,null,null,null,{"$f":"SUMIFS('Nhập liệu'!$H$10:$H$1002,'Nhập liệu'!$E$10:$E$1002,'Vật tư'!$B58,'Nhập liệu'!$C$10:$C$1002,\">=\"&'Thông tin'!$C$12,'Nhập liệu'!$C$10:$C$1002,\"<=\"&'Thông tin'!$C$13)","v":0},{"$f":"SUMIFS('Nhập liệu'!$I$10:$I$1002,'Nhập liệu'!$E$10:$E$1002,'Vật tư'!$B58,'Nhập liệu'!$C$10:$C$1002,\">=\"&'Thông tin'!$C$12,'Nhập liệu'!$C$10:$C$1002,\"<=\"&'Thông tin'!$C$13)","v":0},0]
["",null,null,null,null,{"$f":"SUMIFS('Nhập liệu'!$H$10:$H$1002,'Nhập liệu'!$E$10:$E$1002,'Vật tư'!$B59,'Nhập liệu'!$C$10:$C$1002,\">=\"&'Thông tin'!$C$12,'Nhập liệu'!$C$10:$C$1002,\"<=\"&'Thông tin'!$C$13)","v":0},{"$f":"SUMIFS('Nhập liệu'!$I$10:$I$1002,'Nhập liệu'!$E$10:$E$1002,'Vật tư'!$B59,'Nhập liệu'!$C$10:$C$1002,\">=\"&'Thông tin'!$C$12,'Nhập liệu'!$C$10:$C$1002,\"<=\"&'Thông tin'!$C$13)","v":0},0]
["",null,null,null,null,{"$f":"SUMIFS('Nhập liệu'!$H$10:$H$1002,'Nhập liệu'!$E$10:$E$1002,'Vật tư'!$B60,'Nhập liệu'!$C$10:$C$1002,\">=\"&'Thông tin'!$C$12,'Nhập liệu'!$C$10:$C$1002,\"<=\"&'Thông tin'!$C$13)","v":0},{"$f":"SUMIFS('Nhập liệu'!$I$10:$I$1002,'Nhập liệu'!$E$10:$E$1002,'Vật tư'!$B60,'Nhập liệu'!$C$10:$C$1002,\">=\"&'Thông tin'!$C$12,'Nhập liệu'!$C$10:$C$1002,\"<=\"&'Thông tin'!$C$13)","v":0},0]
["",null,null,null,null,{"$f":"SUMIFS('Nhập liệu'!$H$10:$H$1002,'Nhập liệu'!$E$10:$E$1002,'Vật tư'!$B61,'Nhập liệu'!$C$10:$C$1002,\">=\"&'Thông tin'!$C$12,'Nhập liệu'!$C$10:$C$1002,\"<=\"&'Thông tin'!$C$13)","v":0},{"$f":"SUMIFS('Nhập liệu'!$I$10:$I$1002,'Nhập liệu'!$E$10:$E$1002,'Vật tư'!$B61,'Nhập liệu'!$C$10:$C$1002,\">=\"&'Thông tin'!$C$12,'Nhập liệu'!$C$10:$C$1002,\"<=\"&'Thông tin'!$C$13)","v":0},0]
["",null,null,null,null,{"$f":"SUMIFS('Nhập liệu'!$H$10:$H$1002,'Nhập liệu'!$E$10:$E$1002,'Vật tư'!$B62,'Nhập liệu'!$C$10:$C$1002,\">=\"&'Thông tin'!$C$12,'Nhập liệu'!$C$10:$C$1002,\"<=\"&'Thông tin'!$C$13)","v":0},{"$f":"SUMIFS('Nhập liệu'!$I$10:$I$1002,'Nhập liệu'!$E$10:$E$1002,'Vật tư'!$B62,'Nhập liệu'!$C$10:$C$1002,\">=\"&'Thông tin'!$C$12,'Nhập liệu'!$C$10:$C$1002,\"<=\"&'Thông tin'!$C$13)","v":0},0]
["",null,null,null,null,{"$f":"SUMIFS('Nhập liệu'!$H$10:$H$1002,'Nhập liệu'!$E$10:$E$1002,'Vật tư'!$B63,'Nhập liệu'!$C$10:$C$1002,\">=\"&'Thông tin'!$C$12,'Nhập liệu'!$C$10:$C$1002,\"<=\"&'Thông tin'!$C$13)","v":0},{"$f":"SUMIFS('Nhập liệu'!$I$10:$I$1002,'Nhập liệu'!$E$10:$E$1002,'Vật tư'!$B63,'Nhập liệu'!$C$10:$C$1002,\">=\"&'Thông tin'!$C$12,'Nhập liệu'!$C$10:$C$1002,\"<=\"&'Thông tin'!$C$13)","v":0},0]
["",null,null,null,null,{"$f":"SUMIFS('Nhập liệu'!$H$10:$H$1002,'Nhập liệu'!$E$10:$E$1002,'Vật tư'!$B64,'Nhập liệu'!$C$10:$C$1002,\">=\"&'Thông tin'!$C$12,'Nhập liệu'!$C$10:$C$1002,\"<=\"&'Thông tin'!$C$13)","v":0},{"$f":"SUMIFS('Nhập liệu'!$I$10:$I$1002,'Nhập liệu'!$E$10:$E$1002,'Vật tư'!$B64,'Nhập liệu'!$C$10:$C$1002,\">=\"&'Thông tin'!$C$12,'Nhập liệu'!$C$10:$C$1002,\"<=\"&'Thông tin'!$C$13)","v":0},0]
["",null,null,null,null,{"$f":"SUMIFS('Nhập liệu'!$H$10:$H$1002,'Nhập liệu'!$E$10:$E$1002,'Vật tư'!$B65,'Nhập liệu'!$C$10:$C$1002,\">=\"&'Thông tin'!$C$12,'Nhập liệu'!$C$10:$C$1002,\"<=\"&'Thông tin'!$C$13)","v":0},{"$f":"SUMIFS('Nhập liệu'!$I$10:$I$1002,'Nhập liệu'!$E$10:$E$1002,'Vật tư'!$B65,'Nhập liệu'!$C$10:$C$1002,\">=\"&'Thông tin'!$C$12,'Nhập liệu'!$C$10:$C$1002,\"<=\"&'Thông tin'!$C$13)","v":0},0]
["",null,null,null,null,{"$f":"SUMIFS('Nhập liệu'!$H$10:$H$1002,'Nhập liệu'!$E$10:$E$1002,'Vật tư'!$B66,'Nhập liệu'!$C$10:$C$1002,\">=\"&'Thông tin'!$C$12,'Nhập liệu'!$C$10:$C$1002,\"<=\"&'Thông tin'!$C$13)","v":0},{"$f":"SUMIFS('Nhập liệu'!$I$10:$I$1002,'Nhập liệu'!$E$10:$E$1002,'Vật tư'!$B66,'Nhập liệu'!$C$10:$C$1002,\">=\"&'Thông tin'!$C$12,'Nhập liệu'!$C$10:$C$1002,\"<=\"&'Thông tin'!$C$13)","v":0},0]
["",null,null,null,null,{"$f":"SUMIFS('Nhập liệu'!$H$10:$H$1002,'Nhập liệu'!$E$10:$E$1002,'Vật tư'!$B67,'Nhập liệu'!$C$10:$C$1002,\">=\"&'Thông tin'!$C$12,'Nhập liệu'!$C$10:$C$1002,\"<=\"&'Thông tin'!$C$13)","v":0},{"$f":"SUMIFS('Nhập liệu'!$I$10:$I$1002,'Nhập liệu'!$E$10:$E$1002,'Vật tư'!$B67,'Nhập liệu'!$C$10:$C$1002,\">=\"&'Thông tin'!$C$12,'Nhập liệu'!$C$10:$C$1002,\"<=\"&'Thông tin'!$C$13)","v":0},0]
["",null,null,null,null,{"$f":"SUMIFS('Nhập liệu'!$H$10:$H$1002,'Nhập liệu'!$E$10:$E$1002,'Vật tư'!$B68,'Nhập liệu'!$C$10:$C$1002,\">=\"&'Thông tin'!$C$12,'Nhập liệu'!$C$10:$C$1002,\"<=\"&'Thông tin'!$C$13)","v":0},{"$f":"SUMIFS('Nhập liệu'!$I$10:$I$1002,'Nhập liệu'!$E$10:$E$1002,'Vật tư'!$B68,'Nhập liệu'!$C$10:$C$1002,\">=\"&'Thông tin'!$C$12,'Nhập liệu'!$C$10:$C$1002,\"<=\"&'Thông tin'!$C$13)","v":0},0]
["",null,null,null,null,{"$f":"SUMIFS('Nhập liệu'!$H$10:$H$1002,'Nhập liệu'!$E$10:$E$1002,'Vật tư'!$B69,'Nhập liệu'!$C$10:$C$1002,\">=\"&'Thông tin'!$C$12,'Nhập liệu'!$C$10:$C$1002,\"<=\"&'Thông tin'!$C$13)","v":0},{"$f":"SUMIFS('Nhập liệu'!$I$10:$I$1002,'Nhập liệu'!$E$10:$E$1002,'Vật tư'!$B69,'Nhập liệu'!$C$10:$C$1002,\">=\"&'Thông tin'!$C$12,'Nhập liệu'!$C$10:$C$1002,\"<=\"&'Thông tin'!$C$13)","v":0},0]
["",null,null,null,null,{"$f":"SUMIFS('Nhập liệu'!$H$10:$H$1002,'Nhập liệu'!$E$10:$E$1002,'Vật tư'!$B70,'Nhập liệu'!$C$10:$C$1002,\">=\"&'Thông tin'!$C$12,'Nhập liệu'!$C$10:$C$1002,\"<=\"&'Thông tin'!$C$13)","v":0},{"$f":"SUMIFS('Nhập liệu'!$I$10:$I$1002,'Nhập liệu'!$E$10:$E$1002,'Vật tư'!$B70,'Nhập liệu'!$C$10:$C$1002,\">=\"&'Thông tin'!$C$12,'Nhập liệu'!$C$10:$C$1002,\"<=\"&'Thông tin'!$C$13)","v":0},0]
["",null,null,null,null,{"$f":"SUMIFS('Nhập liệu'!$H$10:$H$1002,'Nhập liệu'!$E$10:$E$1002,'Vật tư'!$B71,'Nhập liệu'!$C$10:$C$1002,\">=\"&'Thông tin'!$C$12,'Nhập liệu'!$C$10:$C$1002,\"<=\"&'Thông tin'!$C$13)","v":0},{"$f":"SUMIFS('Nhập liệu'!$I$10:$I$1002,'Nhập liệu'!$E$10:$E$1002,'Vật tư'!$B71,'Nhập liệu'!$C$10:$C$1002,\">=\"&'Thông tin'!$C$12,'Nhập liệu'!$C$10:$C$1002,\"<=\"&'Thông tin'!$C$13)","v":0},0]
["",null,null,null,null,{"$f":"SUMIFS('Nhập liệu'!$H$10:$H$1002,'Nhập liệu'!$E$10:$E$1002,'Vật tư'!$B72,'Nhập liệu'!$C$10:$C$1002,\">=\"&'Thông tin'!$C$12,'Nhập liệu'!$C$10:$C$1002,\"<=\"&'Thông tin'!$C$13)","v":0},{"$f":"SUMIFS('Nhập liệu'!$I$10:$I$1002,'Nhập liệu'!$E$10:$E$1002,'Vật tư'!$B72,'Nhập liệu'!$C$10:$C$1002,\">=\"&'Thông tin'!$C$12,'Nhập liệu'!$C$10:$C$1002,\"<=\"&'Thông tin'!$C$13)","v":0},0]
["",null,null,null,null,{"$f":"SUMIFS('Nhập liệu'!$H$10:$H$1002,'Nhập liệu'!$E$10:$E$1002,'Vật tư'!$B73,'Nhập liệu'!$C$10:$C$1002,\">=\"&'Thông tin'!$C$12,'Nhập liệu'!$C$10:$C$1002,\"<=\"&'Thông tin'!$C$13)","v":0},{"$f":"SUMIFS('Nhập liệu'!$I$10:$I$1002,'Nhập liệu'!$E$10:$E$1002,'Vật tư'!$B73,'Nhập liệu'!$C$10:$C$1002,\">=\"&'Thông tin'!$C$12,'Nhập liệu'!$C$10:$C$1002,\"<=\"&'Thông tin'!$C$13)","v":0},0]
["",null,null,null,null,{"$f":"SUMIFS('Nhập liệu'!$H$10:$H$1002,'Nhập liệu'!$E$10:$E$1002,'Vật tư'!$B74,'Nhập liệu'!$C$10:$C$1002,\">=\"&'Thông tin'!$C$12,'Nhập liệu'!$C$10:$C$1002,\"<=\"&'Thông tin'!$C$13)","v":0},{"$f":"SUMIFS('Nhập liệu'!$I$10:$I$1002,'Nhập liệu'!$E$10:$E$1002,'Vật tư'!$B74,'Nhập liệu'!$C$10:$C$1002,\">=\"&'Thông tin'!$C$12,'Nhập liệu'!$C$10:$C$1002,\"<=\"&'Thông tin'!$C$13)","v":0},{"$f":"F74-G74","v":0}]
[{"$f":"+IF(OR($A74=\"\",$B75=\"\"),\"\",$A74+1)","v":""},null,null,null,null,{"$f":"SUMIFS('Nhập liệu'!$H$10:$H$1002,'Nhập liệu'!$E$10:$E$1002,'Vật tư'!$B75,'Nhập liệu'!$C$10:$C$1002,\">=\"&'Thông tin'!$C$12,'Nhập liệu'!$C$10:$C$1002,\"<=\"&'Thông tin'!$C$13)","v":0},{"$f":"SUMIFS('Nhập liệu'!$I$10:$I$1002,'Nhập liệu'!$E$10:$E$1002,'Vật tư'!$B75,'Nhập liệu'!$C$10:$C$1002,\">=\"&'Thông tin'!$C$12,'Nhập liệu'!$C$10:$C$1002,\"<=\"&'Thông tin'!$C$13)","v":0},0]
["",null,null,null,null,{"$f":"SUMIFS('Nhập liệu'!$H$10:$H$1002,'Nhập liệu'!$E$10:$E$1002,'Vật tư'!$B76,'Nhập liệu'!$C$10:$C$1002,\">=\"&'Thông tin'!$C$12,'Nhập liệu'!$C$10:$C$1002,\"<=\"&'Thông tin'!$C$13)","v":0},{"$f":"SUMIFS('Nhập liệu'!$I$10:$I$1002,'Nhập liệu'!$E$10:$E$1002,'Vật tư'!$B76,'Nhập liệu'!$C$10:$C$1002,\">=\"&'Thông tin'!$C$12,'Nhập liệu'!$C$10:$C$1002,\"<=\"&'Thông tin'!$C$13)","v":0},0]
["",null,null,null,null,{"$f":"SUMIFS('Nhập liệu'!$H$10:$H$1002,'Nhập liệu'!$E$10:$E$1002,'Vật tư'!$B77,'Nhập liệu'!$C$10:$C$1002,\">=\"&'Thông tin'!$C$12,'Nhập liệu'!$C$10:$C$1002,\"<=\"&'Thông tin'!$C$13)","v":0},{"$f":"SUMIFS('Nhập liệu'!$I$10:$I$1002,'Nhập liệu'!$E$10:$E$1002,'Vật tư'!$B77,'Nhập liệu'!$C$10:$C$1002,\">=\"&'Thông tin'!$C$12,'Nhập liệu'!$C$10:$C$1002,\"<=\"&'Thông tin'!$C$13)","v":0},0]
["",null,null,null,null,{"$f":"SUMIFS('Nhập liệu'!$H$10:$H$1002,'Nhập liệu'!$E$10:$E$1002,'Vật tư'!$B78,'Nhập liệu'!$C$10:$C$1002,\">=\"&'Thông tin'!$C$12,'Nhập liệu'!$C$10:$C$1002,\"<=\"&'Thông tin'!$C$13)","v":0},{"$f":"SUMIFS('Nhập liệu'!$I$10:$I$1002,'Nhập liệu'!$E$10:$E$1002,'Vật tư'!$B78,'Nhập liệu'!$C$10:$C$1002,\">=\"&'Thông tin'!$C$12,'Nhập liệu'!$C$10:$C$1002,\"<=\"&'Thông tin'!$C$13)","v":0},0]
["",null,null,null,null,{"$f":"SUMIFS('Nhập liệu'!$H$10:$H$1002,'Nhập liệu'!$E$10:$E$1002,'Vật tư'!$B79,'Nhập liệu'!$C$10:$C$1002,\">=\"&'Thông tin'!$C$12,'Nhập liệu'!$C$10:$C$1002,\"<=\"&'Thông tin'!$C$13)","v":0},{"$f":"SUMIFS('Nhập liệu'!$I$10:$I$1002,'Nhập liệu'!$E$10:$E$1002,'Vật tư'!$B79,'Nhập liệu'!$C$10:$C$1002,\">=\"&'Thông tin'!$C$12,'Nhập liệu'!$C$10:$C$1002,\"<=\"&'Thông tin'!$C$13)","v":0},0]
["",null,null,null,null,{"$f":"SUMIFS('Nhập liệu'!$H$10:$H$1002,'Nhập liệu'!$E$10:$E$1002,'Vật tư'!$B80,'Nhập liệu'!$C$10:$C$1002,\">=\"&'Thông tin'!$C$12,'Nhập liệu'!$C$10:$C$1002,\"<=\"&'Thông tin'!$C$13)","v":0},{"$f":"SUMIFS('Nhập liệu'!$I$10:$I$1002,'Nhập liệu'!$E$10:$E$1002,'Vật tư'!$B80,'Nhập liệu'!$C$10:$C$1002,\">=\"&'Thông tin'!$C$12,'Nhập liệu'!$C$10:$C$1002,\"<=\"&'Thông tin'!$C$13)","v":0},0]
["",null,null,null,null,{"$f":"SUMIFS('Nhập liệu'!$H$10:$H$1002,'Nhập liệu'!$E$10:$E$1002,'Vật tư'!$B81,'Nhập liệu'!$C$10:$C$1002,\">=\"&'Thông tin'!$C$12,'Nhập liệu'!$C$10:$C$1002,\"<=\"&'Thông tin'!$C$13)","v":0},{"$f":"SUMIFS('Nhập liệu'!$I$10:$I$1002,'Nhập liệu'!$E$10:$E$1002,'Vật tư'!$B81,'Nhập liệu'!$C$10:$C$1002,\">=\"&'Thông tin'!$C$12,'Nhập liệu'!$C$10:$C$1002,\"<=\"&'Thông tin'!$C$13)","v":0},0]
["",null,null,null,null,{"$f":"SUMIFS('Nhập liệu'!$H$10:$H$1002,'Nhập liệu'!$E$10:$E$1002,'Vật tư'!$B82,'Nhập liệu'!$C$10:$C$1002,\">=\"&'Thông tin'!$C$12,'Nhập liệu'!$C$10:$C$1002,\"<=\"&'Thông tin'!$C$13)","v":0},{"$f":"SUMIFS('Nhập liệu'!$I$10:$I$1002,'Nhập liệu'!$E$10:$E$1002,'Vật tư'!$B82,'Nhập liệu'!$C$10:$C$1002,\">=\"&'Thông tin'!$C$12,'Nhập liệu'!$C$10:$C$1002,\"<=\"&'Thông tin'!$C$13)","v":0},0]
["",null,null,null,null,{"$f":"SUMIFS('Nhập liệu'!$H$10:$H$1002,'Nhập liệu'!$E$10:$E$1002,'Vật tư'!$B83,'Nhập liệu'!$C$10:$C$1002,\">=\"&'Thông tin'!$C$12,'Nhập liệu'!$C$10:$C$1002,\"<=\"&'Thông tin'!$C$13)","v":0},{"$f":"SUMIFS('Nhập liệu'!$I$10:$I$1002,'Nhập liệu'!$E$10:$E$1002,'Vật tư'!$B83,'Nhập liệu'!$C$10:$C$1002,\">=\"&'Thông tin'!$C$12,'Nhập liệu'!$C$10:$C$1002,\"<=\"&'Thông tin'!$C$13)","v":0},0]
["",null,null,null,null,{"$f":"SUMIFS('Nhập liệu'!$H$10:$H$1002,'Nhập liệu'!$E$10:$E$1002,'Vật tư'!$B84,'Nhập liệu'!$C$10:$C$1002,\">=\"&'Thông tin'!$C$12,'Nhập liệu'!$C$10:$C$1002,\"<=\"&'Thông tin'!$C$13)","v":0},{"$f":"SUMIFS('Nhập liệu'!$I$10:$I$1002,'Nhập liệu'!$E$10:$E$1002,'Vật tư'!$B84,'Nhập liệu'!$C$10:$C$1002,\">=\"&'Thông tin'!$C$12,'Nhập liệu'!$C$10:$C$1002,\"<=\"&'Thông tin'!$C$13)","v":0},0]
["",null,null,null,null,{"$f":"SUMIFS('Nhập liệu'!$H$10:$H$1002,'Nhập liệu'!$E$10:$E$1002,'Vật tư'!$B85,'Nhập liệu'!$C$10:$C$1002,\">=\"&'Thông tin'!$C$12,'Nhập liệu'!$C$10:$C$1002,\"<=\"&'Thông tin'!$C$13)","v":0},{"$f":"SUMIFS('Nhập liệu'!$I$10:$I$1002,'Nhập liệu'!$E$10:$E$1002,'Vật tư'!$B85,'Nhập liệu'!$C$10:$C$1002,\">=\"&'Thông tin'!$C$12,'Nhập liệu'!$C$10:$C$1002,\"<=\"&'Thông tin'!$C$13)","v":0},0]
["",null,null,null,null,{"$f":"SUMIFS('Nhập liệu'!$H$10:$H$1002,'Nhập liệu'!$E$10:$E$1002,'Vật tư'!$B86,'Nhập liệu'!$C$10:$C$1002,\">=\"&'Thông tin'!$C$12,'Nhập liệu'!$C$10:$C$1002,\"<=\"&'Thông tin'!$C$13)","v":0},{"$f":"SUMIFS('Nhập liệu'!$I$10:$I$1002,'Nhập liệu'!$E$10:$E$1002,'Vật tư'!$B86,'Nhập liệu'!$C$10:$C$1002,\">=\"&'Thông tin'!$C$12,'Nhập liệu'!$C$10:$C$1002,\"<=\"&'Thông tin'!$C$13)","v":0},0]
["",null,null,null,null,{"$f":"SUMIFS('Nhập liệu'!$H$10:$H$1002,'Nhập liệu'!$E$10:$E$1002,'Vật tư'!$B87,'Nhập liệu'!$C$10:$C$1002,\">=\"&'Thông tin'!$C$12,'Nhập liệu'!$C$10:$C$1002,\"<=\"&'Thông tin'!$C$13)","v":0},{"$f":"SUMIFS('Nhập liệu'!$I$10:$I$1002,'Nhập liệu'!$E$10:$E$1002,'Vật tư'!$B87,'Nhập liệu'!$C$10:$C$1002,\">=\"&'Thông tin'!$C$12,'Nhập liệu'!$C$10:$C$1002,\"<=\"&'Thông tin'!$C$13)","v":0},0]
["",null,null,null,null,{"$f":"SUMIFS('Nhập liệu'!$H$10:$H$1002,'Nhập liệu'!$E$10:$E$1002,'Vật tư'!$B88,'Nhập liệu'!$C$10:$C$1002,\">=\"&'Thông tin'!$C$12,'Nhập liệu'!$C$10:$C$1002,\"<=\"&'Thông tin'!$C$13)","v":0},{"$f":"SUMIFS('Nhập liệu'!$I$10:$I$1002,'Nhập liệu'!$E$10:$E$1002,'Vật tư'!$B88,'Nhập liệu'!$C$10:$C$1002,\">=\"&'Thông tin'!$C$12,'Nhập liệu'!$C$10:$C$1002,\"<=\"&'Thông tin'!$C$13)","v":0},0]
["",null,null,null,null,{"$f":"SUMIFS('Nhập liệu'!$H$10:$H$1002,'Nhập liệu'!$E$10:$E$1002,'Vật tư'!$B89,'Nhập liệu'!$C$10:$C$1002,\">=\"&'Thông tin'!$C$12,'Nhập liệu'!$C$10:$C$1002,\"<=\"&'Thông tin'!$C$13)","v":0},{"$f":"SUMIFS('Nhập liệu'!$I$10:$I$1002,'Nhập liệu'!$E$10:$E$1002,'Vật tư'!$B89,'Nhập liệu'!$C$10:$C$1002,\">=\"&'Thông tin'!$C$12,'Nhập liệu'!$C$10:$C$1002,\"<=\"&'Thông tin'!$C$13)","v":0},0]
["",null,null,null,null,{"$f":"SUMIFS('Nhập liệu'!$H$10:$H$1002,'Nhập liệu'!$E$10:$E$1002,'Vật tư'!$B90,'Nhập liệu'!$C$10:$C$1002,\">=\"&'Thông tin'!$C$12,'Nhập liệu'!$C$10:$C$1002,\"<=\"&'Thông tin'!$C$13)","v":0},{"$f":"SUMIFS('Nhập liệu'!$I$10:$I$1002,'Nhập liệu'!$E$10:$E$1002,'Vật tư'!$B90,'Nhập liệu'!$C$10:$C$1002,\">=\"&'Thông tin'!$C$12,'Nhập liệu'!$C$10:$C$1002,\"<=\"&'Thông tin'!$C$13)","v":0},0]
["",null,null,null,null,{"$f":"SUMIFS('Nhập liệu'!$H$10:$H$1002,'Nhập liệu'!$E$10:$E$1002,'Vật tư'!$B91,'Nhập liệu'!$C$10:$C$1002,\">=\"&'Thông tin'!$C$12,'Nhập liệu'!$C$10:$C$1002,\"<=\"&'Thông tin'!$C$13)","v":0},{"$f":"SUMIFS('Nhập liệu'!$I$10:$I$1002,'Nhập liệu'!$E$10:$E$1002,'Vật tư'!$B91,'Nhập liệu'!$C$10:$C$1002,\">=\"&'Thông tin'!$C$12,'Nhập liệu'!$C$10:$C$1002,\"<=\"&'Thông tin'!$C$13)","v":0},0]
["",null,null,null,null,{"$f":"SUMIFS('Nhập liệu'!$H$10:$H$1002,'Nhập liệu'!$E$10:$E$1002,'Vật tư'!$B92,'Nhập liệu'!$C$10:$C$1002,\">=\"&'Thông tin'!$C$12,'Nhập liệu'!$C$10:$C$1002,\"<=\"&'Thông tin'!$C$13)","v":0},{"$f":"SUMIFS('Nhập liệu'!$I$10:$I$1002,'Nhập liệu'!$E$10:$E$1002,'Vật tư'!$B92,'Nhập liệu'!$C$10:$C$1002,\">=\"&'Thông tin'!$C$12,'Nhập liệu'!$C$10:$C$1002,\"<=\"&'Thông tin'!$C$13)","v":0},0]
["",null,null,null,null,{"$f":"SUMIFS('Nhập liệu'!$H$10:$H$1002,'Nhập liệu'!$E$10:$E$1002,'Vật tư'!$B93,'Nhập liệu'!$C$10:$C$1002,\">=\"&'Thông tin'!$C$12,'Nhập liệu'!$C$10:$C$1002,\"<=\"&'Thông tin'!$C$13)","v":0},{"$f":"SUMIFS('Nhập liệu'!$I$10:$I$1002,'Nhập liệu'!$E$10:$E$1002,'Vật tư'!$B93,'Nhập liệu'!$C$10:$C$1002,\">=\"&'Thông tin'!$C$12,'Nhập liệu'!$C$10:$C$1002,\"<=\"&'Thông tin'!$C$13)","v":0},0]
["",null,null,null,null,{"$f":"SUMIFS('Nhập liệu'!$H$10:$H$1002,'Nhập liệu'!$E$10:$E$1002,'Vật tư'!$B94,'Nhập liệu'!$C$10:$C$1002,\">=\"&'Thông tin'!$C$12,'Nhập liệu'!$C$10:$C$1002,\"<=\"&'Thông tin'!$C$13)","v":0},{"$f":"SUMIFS('Nhập liệu'!$I$10:$I$1002,'Nhập liệu'!$E$10:$E$1002,'Vật tư'!$B94,'Nhập liệu'!$C$10:$C$1002,\">=\"&'Thông tin'!$C$12,'Nhập liệu'!$C$10:$C$1002,\"<=\"&'Thông tin'!$C$13)","v":0},0]
["",null,null,null,null,{"$f":"SUMIFS('Nhập liệu'!$H$10:$H$1002,'Nhập liệu'!$E$10:$E$1002,'Vật tư'!$B95,'Nhập liệu'!$C$10:$C$1002,\">=\"&'Thông tin'!$C$12,'Nhập liệu'!$C$10:$C$1002,\"<=\"&'Thông tin'!$C$13)","v":0},{"$f":"SUMIFS('Nhập liệu'!$I$10:$I$1002,'Nhập liệu'!$E$10:$E$1002,'Vật tư'!$B95,'Nhập liệu'!$C$10:$C$1002,\">=\"&'Thông tin'!$C$12,'Nhập liệu'!$C$10:$C$1002,\"<=\"&'Thông tin'!$C$13)","v":0},0]
["",null,null,null,null,{"$f":"SUMIFS('Nhập liệu'!$H$10:$H$1002,'Nhập liệu'!$E$10:$E$1002,'Vật tư'!$B96,'Nhập liệu'!$C$10:$C$1002,\">=\"&'Thông tin'!$C$12,'Nhập liệu'!$C$10:$C$1002,\"<=\"&'Thông tin'!$C$13)","v":0},{"$f":"SUMIFS('Nhập liệu'!$I$10:$I$1002,'Nhập liệu'!$E$10:$E$1002,'Vật tư'!$B96,'Nhập liệu'!$C$10:$C$1002,\">=\"&'Thông tin'!$C$12,'Nhập liệu'!$C$10:$C$1002,\"<=\"&'Thông tin'!$C$13)","v":0},0]
["",null,null,null,null,{"$f":"SUMIFS('Nhập liệu'!$H$10:$H$1002,'Nhập liệu'!$E$10:$E$1002,'Vật tư'!$B97,'Nhập liệu'!$C$10:$C$1002,\">=\"&'Thông tin'!$C$12,'Nhập liệu'!$C$10:$C$1002,\"<=\"&'Thông tin'!$C$13)","v":0},{"$f":"SUMIFS('Nhập liệu'!$I$10:$I$1002,'Nhập liệu'!$E$10:$E$1002,'Vật tư'!$B97,'Nhập liệu'!$C$10:$C$1002,\">=\"&'Thông tin'!$C$12,'Nhập liệu'!$C$10:$C$1002,\"<=\"&'Thông tin'!$C$13)","v":0},0]
["",null,null,null,null,{"$f":"SUMIFS('Nhập liệu'!$H$10:$H$1002,'Nhập liệu'!$E$10:$E$1002,'Vật tư'!$B98,'Nhập liệu'!$C$10:$C$1002,\">=\"&'Thông tin'!$C$12,'Nhập liệu'!$C$10:$C$1002,\"<=\"&'Thông tin'!$C$13)","v":0},{"$f":"SUMIFS('Nhập liệu'!$I$10:$I$1002,'Nhập liệu'!$E$10:$E$1002,'Vật tư'!$B98,'Nhập liệu'!$C$10:$C$1002,\">=\"&'Thông tin'!$C$12,'Nhập liệu'!$C$10:$C$1002,\"<=\"&'Thông tin'!$C$13)","v":0},0]
["",null,null,null,null,{"$f":"SUMIFS('Nhập liệu'!$H$10:$H$1002,'Nhập liệu'!$E$10:$E$1002,'Vật tư'!$B99,'Nhập liệu'!$C$10:$C$1002,\">=\"&'Thông tin'!$C$12,'Nhập liệu'!$C$10:$C$1002,\"<=\"&'Thông tin'!$C$13)","v":0},{"$f":"SUMIFS('Nhập liệu'!$I$10:$I$1002,'Nhập liệu'!$E$10:$E$1002,'Vật tư'!$B99,'Nhập liệu'!$C$10:$C$1002,\">=\"&'Thông tin'!$C$12,'Nhập liệu'!$C$10:$C$1002,\"<=\"&'Thông tin'!$C$13)","v":0},0]
["",null,null,null,null,{"$f":"SUMIFS('Nhập liệu'!$H$10:$H$1002,'Nhập liệu'!$E$10:$E$1002,'Vật tư'!$B100,'Nhập liệu'!$C$10:$C$1002,\">=\"&'Thông tin'!$C$12,'Nhập liệu'!$C$10:$C$1002,\"<=\"&'Thông tin'!$C$13)","v":0},{"$f":"SUMIFS('Nhập liệu'!$I$10:$I$1002,'Nhập liệu'!$E$10:$E$1002,'Vật tư'!$B100,'Nhập liệu'!$C$10:$C$1002,\">=\"&'Thông tin'!$C$12,'Nhập liệu'!$C$10:$C$1002,\"<=\"&'Thông tin'!$C$13)","v":0},0]
["",null,null,null,null,{"$f":"SUMIFS('Nhập liệu'!$H$10:$H$1002,'Nhập liệu'!$E$10:$E$1002,'Vật tư'!$B101,'Nhập liệu'!$C$10:$C$1002,\">=\"&'Thông tin'!$C$12,'Nhập liệu'!$C$10:$C$1002,\"<=\"&'Thông tin'!$C$13)","v":0},{"$f":"SUMIFS('Nhập liệu'!$I$10:$I$1002,'Nhập liệu'!$E$10:$E$1002,'Vật tư'!$B101,'Nhập liệu'!$C$10:$C$1002,\">=\"&'Thông tin'!$C$12,'Nhập liệu'!$C$10:$C$1002,\"<=\"&'Thông tin'!$C$13)","v":0},0]
["",null,null,null,null,{"$f":"SUMIFS('Nhập liệu'!$H$10:$H$1002,'Nhập liệu'!$E$10:$E$1002,'Vật tư'!$B102,'Nhập liệu'!$C$10:$C$1002,\">=\"&'Thông tin'!$C$12,'Nhập liệu'!$C$10:$C$1002,\"<=\"&'Thông tin'!$C$13)","v":0},{"$f":"SUMIFS('Nhập liệu'!$I$10:$I$1002,'Nhập liệu'!$E$10:$E$1002,'Vật tư'!$B102,'Nhập liệu'!$C$10:$C$1002,\">=\"&'Thông tin'!$C$12,'Nhập liệu'!$C$10:$C$1002,\"<=\"&'Thông tin'!$C$13)","v":0},0]
["",null,null,null,null,{"$f":"SUMIFS('Nhập liệu'!$H$10:$H$1002,'Nhập liệu'!$E$10:$E$1002,'Vật tư'!$B103,'Nhập liệu'!$C$10:$C$1002,\">=\"&'Thông tin'!$C$12,'Nhập liệu'!$C$10:$C$1002,\"<=\"&'Thông tin'!$C$13)","v":0},{"$f":"SUMIFS('Nhập liệu'!$I$10:$I$1002,'Nhập liệu'!$E$10:$E$1002,'Vật tư'!$B103,'Nhập liệu'!$C$10:$C$1002,\">=\"&'Thông tin'!$C$12,'Nhập liệu'!$C$10:$C$1002,\"<=\"&'Thông tin'!$C$13)","v":0},0]
["",null,null,null,null,{"$f":"SUMIFS('Nhập liệu'!$H$10:$H$1002,'Nhập liệu'!$E$10:$E$1002,'Vật tư'!$B104,'Nhập liệu'!$C$10:$C$1002,\">=\"&'Thông tin'!$C$12,'Nhập liệu'!$C$10:$C$1002,\"<=\"&'Thông tin'!$C$13)","v":0},{"$f":"SUMIFS('Nhập liệu'!$I$10:$I$1002,'Nhập liệu'!$E$10:$E$1002,'Vật tư'!$B104,'Nhập liệu'!$C$10:$C$1002,\">=\"&'Thông tin'!$C$12,'Nhập liệu'!$C$10:$C$1002,\"<=\"&'Thông tin'!$C$13)","v":0},0]
["",null,null,null,null,{"$f":"SUMIFS('Nhập liệu'!$H$10:$H$1002,'Nhập liệu'!$E$10:$E$1002,'Vật tư'!$B105,'Nhập liệu'!$C$10:$C$1002,\">=\"&'Thông tin'!$C$12,'Nhập liệu'!$C$10:$C$1002,\"<=\"&'Thông tin'!$C$13)","v":0},{"$f":"SUMIFS('Nhập liệu'!$I$10:$I$1002,'Nhập liệu'!$E$10:$E$1002,'Vật tư'!$B105,'Nhập liệu'!$C$10:$C$1002,\">=\"&'Thông tin'!$C$12,'Nhập liệu'!$C$10:$C$1002,\"<=\"&'Thông tin'!$C$13)","v":0},0]
["",null,null,null,null,{"$f":"SUMIFS('Nhập liệu'!$H$10:$H$1002,'Nhập liệu'!$E$10:$E$1002,'Vật tư'!$B106,'Nhập liệu'!$C$10:$C$1002,\">=\"&'Thông tin'!$C$12,'Nhập liệu'!$C$10:$C$1002,\"<=\"&'Thông tin'!$C$13)","v":0},{"$f":"SUMIFS('Nhập liệu'!$I$10:$I$1002,'Nhập liệu'!$E$10:$E$1002,'Vật tư'!$B106,'Nhập liệu'!$C$10:$C$1002,\">=\"&'Thông tin'!$C$12,'Nhập liệu'!$C$10:$C$1002,\"<=\"&'Thông tin'!$C$13)","v":0},0]
["",null,null,null,null,{"$f":"SUMIFS('Nhập liệu'!$H$10:$H$1002,'Nhập liệu'!$E$10:$E$1002,'Vật tư'!$B107,'Nhập liệu'!$C$10:$C$1002,\">=\"&'Thông tin'!$C$12,'Nhập liệu'!$C$10:$C$1002,\"<=\"&'Thông tin'!$C$13)","v":0},{"$f":"SUMIFS('Nhập liệu'!$I$10:$I$1002,'Nhập liệu'!$E$10:$E$1002,'Vật tư'!$B107,'Nhập liệu'!$C$10:$C$1002,\">=\"&'Thông tin'!$C$12,'Nhập liệu'!$C$10:$C$1002,\"<=\"&'Thông tin'!$C$13)","v":0},0]
["",null,null,null,null,{"$f":"SUMIFS('Nhập liệu'!$H$10:$H$1002,'Nhập liệu'!$E$10:$E$1002,'Vật tư'!$B108,'Nhập liệu'!$C$10:$C$1002,\">=\"&'Thông tin'!$C$12,'Nhập liệu'!$C$10:$C$1002,\"<=\"&'Thông tin'!$C$13)","v":0},{"$f":"SUMIFS('Nhập liệu'!$I$10:$I$1002,'Nhập liệu'!$E$10:$E$1002,'Vật tư'!$B108,'Nhập liệu'!$C$10:$C$1002,\">=\"&'Thông tin'!$C$12,'Nhập liệu'!$C$10:$C$1002,\"<=\"&'Thông tin'!$C$13)","v":0},0]
["",null,null,null,null,{"$f":"SUMIFS('Nhập liệu'!$H$10:$H$1002,'Nhập liệu'!$E$10:$E$1002,'Vật tư'!$B109,'Nhập liệu'!$C$10:$C$1002,\">=\"&'Thông tin'!$C$12,'Nhập liệu'!$C$10:$C$1002,\"<=\"&'Thông tin'!$C$13)","v":0},{"$f":"SUMIFS('Nhập liệu'!$I$10:$I$1002,'Nhập liệu'!$E$10:$E$1002,'Vật tư'!$B109,'Nhập liệu'!$C$10:$C$1002,\">=\"&'Thông tin'!$C$12,'Nhập liệu'!$C$10:$C$1002,\"<=\"&'Thông tin'!$C$13)","v":0},0]
["",null,null,null,null,{"$f":"SUMIFS('Nhập liệu'!$H$10:$H$1002,'Nhập liệu'!$E$10:$E$1002,'Vật tư'!$B110,'Nhập liệu'!$C$10:$C$1002,\">=\"&'Thông tin'!$C$12,'Nhập liệu'!$C$10:$C$1002,\"<=\"&'Thông tin'!$C$13)","v":0},{"$f":"SUMIFS('Nhập liệu'!$I$10:$I$1002,'Nhập liệu'!$E$10:$E$1002,'Vật tư'!$B110,'Nhập liệu'!$C$10:$C$1002,\">=\"&'Thông tin'!$C$12,'Nhập liệu'!$C$10:$C$1002,\"<=\"&'Thông tin'!$C$13)","v":0},0]
["",null,null,null,null,{"$f":"SUMIFS('Nhập liệu'!$H$10:$H$1002,'Nhập liệu'!$E$10:$E$1002,'Vật tư'!$B111,'Nhập liệu'!$C$10:$C$1002,\">=\"&'Thông tin'!$C$12,'Nhập liệu'!$C$10:$C$1002,\"<=\"&'Thông tin'!$C$13)","v":0},{"$f":"SUMIFS('Nhập liệu'!$I$10:$I$1002,'Nhập liệu'!$E$10:$E$1002,'Vật tư'!$B111,'Nhập liệu'!$C$10:$C$1002,\">=\"&'Thông tin'!$C$12,'Nhập liệu'!$C$10:$C$1002,\"<=\"&'Thông tin'!$C$13)","v":0},0]
["",null,null,null,null,{"$f":"SUMIFS('Nhập liệu'!$H$10:$H$1002,'Nhập liệu'!$E$10:$E$1002,'Vật tư'!$B112,'Nhập liệu'!$C$10:$C$1002,\">=\"&'Thông tin'!$C$12,'Nhập liệu'!$C$10:$C$1002,\"<=\"&'Thông tin'!$C$13)","v":0},{"$f":"SUMIFS('Nhập liệu'!$I$10:$I$1002,'Nhập liệu'!$E$10:$E$1002,'Vật tư'!$B112,'Nhập liệu'!$C$10:$C$1002,\">=\"&'Thông tin'!$C$12,'Nhập liệu'!$C$10:$C$1002,\"<=\"&'Thông tin'!$C$13)","v":0},0]
["",null,null,null,null,{"$f":"SUMIFS('Nhập liệu'!$H$10:$H$1002,'Nhập liệu'!$E$10:$E$1002,'Vật tư'!$B113,'Nhập liệu'!$C$10:$C$1002,\">=\"&'Thông tin'!$C$12,'Nhập liệu'!$C$10:$C$1002,\"<=\"&'Thông tin'!$C$13)","v":0},{"$f":"SUMIFS('Nhập liệu'!$I$10:$I$1002,'Nhập liệu'!$E$10:$E$1002,'Vật tư'!$B113,'Nhập liệu'!$C$10:$C$1002,\">=\"&'Thông tin'!$C$12,'Nhập liệu'!$C$10:$C$1002,\"<=\"&'Thông tin'!$C$13)","v":0},0]
["",null,null,null,null,{"$f":"SUMIFS('Nhập liệu'!$H$10:$H$1002,'Nhập liệu'!$E$10:$E$1002,'Vật tư'!$B114,'Nhập liệu'!$C$10:$C$1002,\">=\"&'Thông tin'!$C$12,'Nhập liệu'!$C$10:$C$1002,\"<=\"&'Thông tin'!$C$13)","v":0},{"$f":"SUMIFS('Nhập liệu'!$I$10:$I$1002,'Nhập liệu'!$E$10:$E$1002,'Vật tư'!$B114,'Nhập liệu'!$C$10:$C$1002,\">=\"&'Thông tin'!$C$12,'Nhập liệu'!$C$10:$C$1002,\"<=\"&'Thông tin'!$C$13)","v":0},0]
["",null,null,null,null,{"$f":"SUMIFS('Nhập liệu'!$H$10:$H$1002,'Nhập liệu'!$E$10:$E$1002,'Vật tư'!$B115,'Nhập liệu'!$C$10:$C$1002,\">=\"&'Thông tin'!$C$12,'Nhập liệu'!$C$10:$C$1002,\"<=\"&'Thông tin'!$C$13)","v":0},{"$f":"SUMIFS('Nhập liệu'!$I$10:$I$1002,'Nhập liệu'!$E$10:$E$1002,'Vật tư'!$B115,'Nhập liệu'!$C$10:$C$1002,\">=\"&'Thông tin'!$C$12,'Nhập liệu'!$C$10:$C$1002,\"<=\"&'Thông tin'!$C$13)","v":0},0]
["",null,null,null,null,{"$f":"SUMIFS('Nhập liệu'!$H$10:$H$1002,'Nhập liệu'!$E$10:$E$1002,'Vật tư'!$B116,'Nhập liệu'!$C$10:$C$1002,\">=\"&'Thông tin'!$C$12,'Nhập liệu'!$C$10:$C$1002,\"<=\"&'Thông tin'!$C$13)","v":0},{"$f":"SUMIFS('Nhập liệu'!$I$10:$I$1002,'Nhập liệu'!$E$10:$E$1002,'Vật tư'!$B116,'Nhập liệu'!$C$10:$C$1002,\">=\"&'Thông tin'!$C$12,'Nhập liệu'!$C$10:$C$1002,\"<=\"&'Thông tin'!$C$13)","v":0},0]
["",null,null,null,null,{"$f":"SUMIFS('Nhập liệu'!$H$10:$H$1002,'Nhập liệu'!$E$10:$E$1002,'Vật tư'!$B117,'Nhập liệu'!$C$10:$C$1002,\">=\"&'Thông tin'!$C$12,'Nhập liệu'!$C$10:$C$1002,\"<=\"&'Thông tin'!$C$13)","v":0},{"$f":"SUMIFS('Nhập liệu'!$I$10:$I$1002,'Nhập liệu'!$E$10:$E$1002,'Vật tư'!$B117,'Nhập liệu'!$C$10:$C$1002,\">=\"&'Thông tin'!$C$12,'Nhập liệu'!$C$10:$C$1002,\"<=\"&'Thông tin'!$C$13)","v":0},0]
["",null,null,null,null,{"$f":"SUMIFS('Nhập liệu'!$H$10:$H$1002,'Nhập liệu'!$E$10:$E$1002,'Vật tư'!$B118,'Nhập liệu'!$C$10:$C$1002,\">=\"&'Thông tin'!$C$12,'Nhập liệu'!$C$10:$C$1002,\"<=\"&'Thông tin'!$C$13)","v":0},{"$f":"SUMIFS('Nhập liệu'!$I$10:$I$1002,'Nhập liệu'!$E$10:$E$1002,'Vật tư'!$B118,'Nhập liệu'!$C$10:$C$1002,\">=\"&'Thông tin'!$C$12,'Nhập liệu'!$C$10:$C$1002,\"<=\"&'Thông tin'!$C$13)","v":0},0]
["",null,null,null,null,{"$f":"SUMIFS('Nhập liệu'!$H$10:$H$1002,'Nhập liệu'!$E$10:$E$1002,'Vật tư'!$B119,'Nhập liệu'!$C$10:$C$1002,\">=\"&'Thông tin'!$C$12,'Nhập liệu'!$C$10:$C$1002,\"<=\"&'Thông tin'!$C$13)","v":0},{"$f":"SUMIFS('Nhập liệu'!$I$10:$I$1002,'Nhập liệu'!$E$10:$E$1002,'Vật tư'!$B119,'Nhập liệu'!$C$10:$C$1002,\">=\"&'Thông tin'!$C$12,'Nhập liệu'!$C$10:$C$1002,\"<=\"&'Thông tin'!$C$13)","v":0},0]
["",null,null,null,null,{"$f":"SUMIFS('Nhập liệu'!$H$10:$H$1002,'Nhập liệu'!$E$10:$E$1002,'Vật tư'!$B120,'Nhập liệu'!$C$10:$C$1002,\">=\"&'Thông tin'!$C$12,'Nhập liệu'!$C$10:$C$1002,\"<=\"&'Thông tin'!$C$13)","v":0},{"$f":"SUMIFS('Nhập liệu'!$I$10:$I$1002,'Nhập liệu'!$E$10:$E$1002,'Vật tư'!$B120,'Nhập liệu'!$C$10:$C$1002,\">=\"&'Thông tin'!$C$12,'Nhập liệu'!$C$10:$C$1002,\"<=\"&'Thông tin'!$C$13)","v":0},0]
["",null,null,null,null,{"$f":"SUMIFS('Nhập liệu'!$H$10:$H$1002,'Nhập liệu'!$E$10:$E$1002,'Vật tư'!$B121,'Nhập liệu'!$C$10:$C$1002,\">=\"&'Thông tin'!$C$12,'Nhập liệu'!$C$10:$C$1002,\"<=\"&'Thông tin'!$C$13)","v":0},{"$f":"SUMIFS('Nhập liệu'!$I$10:$I$1002,'Nhập liệu'!$E$10:$E$1002,'Vật tư'!$B121,'Nhập liệu'!$C$10:$C$1002,\">=\"&'Thông tin'!$C$12,'Nhập liệu'!$C$10:$C$1002,\"<=\"&'Thông tin'!$C$13)","v":0},0]
["",null,null,null,null,{"$f":"SUMIFS('Nhập liệu'!$H$10:$H$1002,'Nhập liệu'!$E$10:$E$1002,'Vật tư'!$B122,'Nhập liệu'!$C$10:$C$1002,\">=\"&'Thông tin'!$C$12,'Nhập liệu'!$C$10:$C$1002,\"<=\"&'Thông tin'!$C$13)","v":0},{"$f":"SUMIFS('Nhập liệu'!$I$10:$I$1002,'Nhập liệu'!$E$10:$E$1002,'Vật tư'!$B122,'Nhập liệu'!$C$10:$C$1002,\">=\"&'Thông tin'!$C$12,'Nhập liệu'!$C$10:$C$1002,\"<=\"&'Thông tin'!$C$13)","v":0},0]
["",null,null,null,null,{"$f":"SUMIFS('Nhập liệu'!$H$10:$H$1002,'Nhập liệu'!$E$10:$E$1002,'Vật tư'!$B123,'Nhập liệu'!$C$10:$C$1002,\">=\"&'Thông tin'!$C$12,'Nhập liệu'!$C$10:$C$1002,\"<=\"&'Thông tin'!$C$13)","v":0},{"$f":"SUMIFS('Nhập liệu'!$I$10:$I$1002,'Nhập liệu'!$E$10:$E$1002,'Vật tư'!$B123,'Nhập liệu'!$C$10:$C$1002,\">=\"&'Thông tin'!$C$12,'Nhập liệu'!$C$10:$C$1002,\"<=\"&'Thông tin'!$C$13)","v":0},0]
["",null,null,null,null,{"$f":"SUMIFS('Nhập liệu'!$H$10:$H$1002,'Nhập liệu'!$E$10:$E$1002,'Vật tư'!$B124,'Nhập liệu'!$C$10:$C$1002,\">=\"&'Thông tin'!$C$12,'Nhập liệu'!$C$10:$C$1002,\"<=\"&'Thông tin'!$C$13)","v":0},{"$f":"SUMIFS('Nhập liệu'!$I$10:$I$1002,'Nhập liệu'!$E$10:$E$1002,'Vật tư'!$B124,'Nhập liệu'!$C$10:$C$1002,\">=\"&'Thông tin'!$C$12,'Nhập liệu'!$C$10:$C$1002,\"<=\"&'Thông tin'!$C$13)","v":0},0]
["",null,null,null,null,{"$f":"SUMIFS('Nhập liệu'!$H$10:$H$1002,'Nhập liệu'!$E$10:$E$1002,'Vật tư'!$B125,'Nhập liệu'!$C$10:$C$1002,\">=\"&'Thông tin'!$C$12,'Nhập liệu'!$C$10:$C$1002,\"<=\"&'Thông tin'!$C$13)","v":0},{"$f":"SUMIFS('Nhập liệu'!$I$10:$I$1002,'Nhập liệu'!$E$10:$E$1002,'Vật tư'!$B125,'Nhập liệu'!$C$10:$C$1002,\">=\"&'Thông tin'!$C$12,'Nhập liệu'!$C$10:$C$1002,\"<=\"&'Thông tin'!$C$13)","v":0},0]
["",null,null,null,null,{"$f":"SUMIFS('Nhập liệu'!$H$10:$H$1002,'Nhập liệu'!$E$10:$E$1002,'Vật tư'!$B126,'Nhập liệu'!$C$10:$C$1002,\">=\"&'Thông tin'!$C$12,'Nhập liệu'!$C$10:$C$1002,\"<=\"&'Thông tin'!$C$13)","v":0},{"$f":"SUMIFS('Nhập liệu'!$I$10:$I$1002,'Nhập liệu'!$E$10:$E$1002,'Vật tư'!$B126,'Nhập liệu'!$C$10:$C$1002,\">=\"&'Thông tin'!$C$12,'Nhập liệu'!$C$10:$C$1002,\"<=\"&'Thông tin'!$C$13)","v":0},0]
["",null,null,null,null,{"$f":"SUMIFS('Nhập liệu'!$H$10:$H$1002,'Nhập liệu'!$E$10:$E$1002,'Vật tư'!$B127,'Nhập liệu'!$C$10:$C$1002,\">=\"&'Thông tin'!$C$12,'Nhập liệu'!$C$10:$C$1002,\"<=\"&'Thông tin'!$C$13)","v":0},{"$f":"SUMIFS('Nhập liệu'!$I$10:$I$1002,'Nhập liệu'!$E$10:$E$1002,'Vật tư'!$B127,'Nhập liệu'!$C$10:$C$1002,\">=\"&'Thông tin'!$C$12,'Nhập liệu'!$C$10:$C$1002,\"<=\"&'Thông tin'!$C$13)","v":0},0]
["",null,null,null,null,{"$f":"SUMIFS('Nhập liệu'!$H$10:$H$1002,'Nhập liệu'!$E$10:$E$1002,'Vật tư'!$B128,'Nhập liệu'!$C$10:$C$1002,\">=\"&'Thông tin'!$C$12,'Nhập liệu'!$C$10:$C$1002,\"<=\"&'Thông tin'!$C$13)","v":0},{"$f":"SUMIFS('Nhập liệu'!$I$10:$I$1002,'Nhập liệu'!$E$10:$E$1002,'Vật tư'!$B128,'Nhập liệu'!$C$10:$C$1002,\">=\"&'Thông tin'!$C$12,'Nhập liệu'!$C$10:$C$1002,\"<=\"&'Thông tin'!$C$13)","v":0},0]
["",null,null,null,null,{"$f":"SUMIFS('Nhập liệu'!$H$10:$H$1002,'Nhập liệu'!$E$10:$E$1002,'Vật tư'!$B129,'Nhập liệu'!$C$10:$C$1002,\">=\"&'Thông tin'!$C$12,'Nhập liệu'!$C$10:$C$1002,\"<=\"&'Thông tin'!$C$13)","v":0},{"$f":"SUMIFS('Nhập liệu'!$I$10:$I$1002,'Nhập liệu'!$E$10:$E$1002,'Vật tư'!$B129,'Nhập liệu'!$C$10:$C$1002,\">=\"&'Thông tin'!$C$12,'Nhập liệu'!$C$10:$C$1002,\"<=\"&'Thông tin'!$C$13)","v":0},0]
["",null,null,null,null,{"$f":"SUMIFS('Nhập liệu'!$H$10:$H$1002,'Nhập liệu'!$E$10:$E$1002,'Vật tư'!$B130,'Nhập liệu'!$C$10:$C$1002,\">=\"&'Thông tin'!$C$12,'Nhập liệu'!$C$10:$C$1002,\"<=\"&'Thông tin'!$C$13)","v":0},{"$f":"SUMIFS('Nhập liệu'!$I$10:$I$1002,'Nhập liệu'!$E$10:$E$1002,'Vật tư'!$B130,'Nhập liệu'!$C$10:$C$1002,\">=\"&'Thông tin'!$C$12,'Nhập liệu'!$C$10:$C$1002,\"<=\"&'Thông tin'!$C$13)","v":0},0]
["",null,null,null,null,{"$f":"SUMIFS('Nhập liệu'!$H$10:$H$1002,'Nhập liệu'!$E$10:$E$1002,'Vật tư'!$B131,'Nhập liệu'!$C$10:$C$1002,\">=\"&'Thông tin'!$C$12,'Nhập liệu'!$C$10:$C$1002,\"<=\"&'Thông tin'!$C$13)","v":0},{"$f":"SUMIFS('Nhập liệu'!$I$10:$I$1002,'Nhập liệu'!$E$10:$E$1002,'Vật tư'!$B131,'Nhập liệu'!$C$10:$C$1002,\">=\"&'Thông tin'!$C$12,'Nhập liệu'!$C$10:$C$1002,\"<=\"&'Thông tin'!$C$13)","v":0},0]
["",null,null,null,null,{"$f":"SUMIFS('Nhập liệu'!$H$10:$H$1002,'Nhập liệu'!$E$10:$E$1002,'Vật tư'!$B132,'Nhập liệu'!$C$10:$C$1002,\">=\"&'Thông tin'!$C$12,'Nhập liệu'!$C$10:$C$1002,\"<=\"&'Thông tin'!$C$13)","v":0},{"$f":"SUMIFS('Nhập liệu'!$I$10:$I$1002,'Nhập liệu'!$E$10:$E$1002,'Vật tư'!$B132,'Nhập liệu'!$C$10:$C$1002,\">=\"&'Thông tin'!$C$12,'Nhập liệu'!$C$10:$C$1002,\"<=\"&'Thông tin'!$C$13)","v":0},0]
["",null,null,null,null,{"$f":"SUMIFS('Nhập liệu'!$H$10:$H$1002,'Nhập liệu'!$E$10:$E$1002,'Vật tư'!$B133,'Nhập liệu'!$C$10:$C$1002,\">=\"&'Thông tin'!$C$12,'Nhập liệu'!$C$10:$C$1002,\"<=\"&'Thông tin'!$C$13)","v":0},{"$f":"SUMIFS('Nhập liệu'!$I$10:$I$1002,'Nhập liệu'!$E$10:$E$1002,'Vật tư'!$B133,'Nhập liệu'!$C$10:$C$1002,\">=\"&'Thông tin'!$C$12,'Nhập liệu'!$C$10:$C$1002,\"<=\"&'Thông tin'!$C$13)","v":0},0]
["",null,null,null,null,{"$f":"SUMIFS('Nhập liệu'!$H$10:$H$1002,'Nhập liệu'!$E$10:$E$1002,'Vật tư'!$B134,'Nhập liệu'!$C$10:$C$1002,\">=\"&'Thông tin'!$C$12,'Nhập liệu'!$C$10:$C$1002,\"<=\"&'Thông tin'!$C$13)","v":0},{"$f":"SUMIFS('Nhập liệu'!$I$10:$I$1002,'Nhập liệu'!$E$10:$E$1002,'Vật tư'!$B134,'Nhập liệu'!$C$10:$C$1002,\">=\"&'Thông tin'!$C$12,'Nhập liệu'!$C$10:$C$1002,\"<=\"&'Thông tin'!$C$13)","v":0},0]
["",null,null,null,null,{"$f":"SUMIFS('Nhập liệu'!$H$10:$H$1002,'Nhập liệu'!$E$10:$E$1002,'Vật tư'!$B135,'Nhập liệu'!$C$10:$C$1002,\">=\"&'Thông tin'!$C$12,'Nhập liệu'!$C$10:$C$1002,\"<=\"&'Thông tin'!$C$13)","v":0},{"$f":"SUMIFS('Nhập liệu'!$I$10:$I$1002,'Nhập liệu'!$E$10:$E$1002,'Vật tư'!$B135,'Nhập liệu'!$C$10:$C$1002,\">=\"&'Thông tin'!$C$12,'Nhập liệu'!$C$10:$C$1002,\"<=\"&'Thông tin'!$C$13)","v":0},0]
["",null,null,null,null,{"$f":"SUMIFS('Nhập liệu'!$H$10:$H$1002,'Nhập liệu'!$E$10:$E$1002,'Vật tư'!$B136,'Nhập liệu'!$C$10:$C$1002,\">=\"&'Thông tin'!$C$12,'Nhập liệu'!$C$10:$C$1002,\"<=\"&'Thông tin'!$C$13)","v":0},{"$f":"SUMIFS('Nhập liệu'!$I$10:$I$1002,'Nhập liệu'!$E$10:$E$1002,'Vật tư'!$B136,'Nhập liệu'!$C$10:$C$1002,\">=\"&'Thông tin'!$C$12,'Nhập liệu'!$C$10:$C$1002,\"<=\"&'Thông tin'!$C$13)","v":0},0]
["",null,null,null,null,{"$f":"SUMIFS('Nhập liệu'!$H$10:$H$1002,'Nhập liệu'!$E$10:$E$1002,'Vật tư'!$B137,'Nhập liệu'!$C$10:$C$1002,\">=\"&'Thông tin'!$C$12,'Nhập liệu'!$C$10:$C$1002,\"<=\"&'Thông tin'!$C$13)","v":0},{"$f":"SUMIFS('Nhập liệu'!$I$10:$I$1002,'Nhập liệu'!$E$10:$E$1002,'Vật tư'!$B137,'Nhập liệu'!$C$10:$C$1002,\">=\"&'Thông tin'!$C$12,'Nhập liệu'!$C$10:$C$1002,\"<=\"&'Thông tin'!$C$13)","v":0},0]
["",null,null,null,null,{"$f":"SUMIFS('Nhập liệu'!$H$10:$H$1002,'Nhập liệu'!$E$10:$E$1002,'Vật tư'!$B138,'Nhập liệu'!$C$10:$C$1002,\">=\"&'Thông tin'!$C$12,'Nhập liệu'!$C$10:$C$1002,\"<=\"&'Thông tin'!$C$13)","v":0},{"$f":"SUMIFS('Nhập liệu'!$I$10:$I$1002,'Nhập liệu'!$E$10:$E$1002,'Vật tư'!$B138,'Nhập liệu'!$C$10:$C$1002,\">=\"&'Thông tin'!$C$12,'Nhập liệu'!$C$10:$C$1002,\"<=\"&'Thông tin'!$C$13)","v":0},{"$f":"F138-G138","v":0}]
[{"$f":"+IF(OR($A138=\"\",$B139=\"\"),\"\",$A138+1)","v":""},null,null,null,null,{"$f":"SUMIFS('Nhập liệu'!$H$10:$H$1002,'Nhập liệu'!$E$10:$E$1002,'Vật tư'!$B139,'Nhập liệu'!$C$10:$C$1002,\">=\"&'Thông tin'!$C$12,'Nhập liệu'!$C$10:$C$1002,\"<=\"&'Thông tin'!$C$13)","v":0},{"$f":"SUMIFS('Nhập liệu'!$I$10:$I$1002,'Nhập liệu'!$E$10:$E$1002,'Vật tư'!$B139,'Nhập liệu'!$C$10:$C$1002,\">=\"&'Thông tin'!$C$12,'Nhập liệu'!$C$10:$C$1002,\"<=\"&'Thông tin'!$C$13)","v":0},0]
["",null,null,null,null,{"$f":"SUMIFS('Nhập liệu'!$H$10:$H$1002,'Nhập liệu'!$E$10:$E$1002,'Vật tư'!$B140,'Nhập liệu'!$C$10:$C$1002,\">=\"&'Thông tin'!$C$12,'Nhập liệu'!$C$10:$C$1002,\"<=\"&'Thông tin'!$C$13)","v":0},{"$f":"SUMIFS('Nhập liệu'!$I$10:$I$1002,'Nhập liệu'!$E$10:$E$1002,'Vật tư'!$B140,'Nhập liệu'!$C$10:$C$1002,\">=\"&'Thông tin'!$C$12,'Nhập liệu'!$C$10:$C$1002,\"<=\"&'Thông tin'!$C$13)","v":0},0]
["",null,null,null,null,{"$f":"SUMIFS('Nhập liệu'!$H$10:$H$1002,'Nhập liệu'!$E$10:$E$1002,'Vật tư'!$B141,'Nhập liệu'!$C$10:$C$1002,\">=\"&'Thông tin'!$C$12,'Nhập liệu'!$C$10:$C$1002,\"<=\"&'Thông tin'!$C$13)","v":0},{"$f":"SUMIFS('Nhập liệu'!$I$10:$I$1002,'Nhập liệu'!$E$10:$E$1002,'Vật tư'!$B141,'Nhập liệu'!$C$10:$C$1002,\">=\"&'Thông tin'!$C$12,'Nhập liệu'!$C$10:$C$1002,\"<=\"&'Thông tin'!$C$13)","v":0},0]
["",null,null,null,null,{"$f":"SUMIFS('Nhập liệu'!$H$10:$H$1002,'Nhập liệu'!$E$10:$E$1002,'Vật tư'!$B142,'Nhập liệu'!$C$10:$C$1002,\">=\"&'Thông tin'!$C$12,'Nhập liệu'!$C$10:$C$1002,\"<=\"&'Thông tin'!$C$13)","v":0},{"$f":"SUMIFS('Nhập liệu'!$I$10:$I$1002,'Nhập liệu'!$E$10:$E$1002,'Vật tư'!$B142,'Nhập liệu'!$C$10:$C$1002,\">=\"&'Thông tin'!$C$12,'Nhập liệu'!$C$10:$C$1002,\"<=\"&'Thông tin'!$C$13)","v":0},0]
["",null,null,null,null,{"$f":"SUMIFS('Nhập liệu'!$H$10:$H$1002,'Nhập liệu'!$E$10:$E$1002,'Vật tư'!$B143,'Nhập liệu'!$C$10:$C$1002,\">=\"&'Thông tin'!$C$12,'Nhập liệu'!$C$10:$C$1002,\"<=\"&'Thông tin'!$C$13)","v":0},{"$f":"SUMIFS('Nhập liệu'!$I$10:$I$1002,'Nhập liệu'!$E$10:$E$1002,'Vật tư'!$B143,'Nhập liệu'!$C$10:$C$1002,\">=\"&'Thông tin'!$C$12,'Nhập liệu'!$C$10:$C$1002,\"<=\"&'Thông tin'!$C$13)","v":0},0]
["",null,null,null,null,{"$f":"SUMIFS('Nhập liệu'!$H$10:$H$1002,'Nhập liệu'!$E$10:$E$1002,'Vật tư'!$B144,'Nhập liệu'!$C$10:$C$1002,\">=\"&'Thông tin'!$C$12,'Nhập liệu'!$C$10:$C$1002,\"<=\"&'Thông tin'!$C$13)","v":0},{"$f":"SUMIFS('Nhập liệu'!$I$10:$I$1002,'Nhập liệu'!$E$10:$E$1002,'Vật tư'!$B144,'Nhập liệu'!$C$10:$C$1002,\">=\"&'Thông tin'!$C$12,'Nhập liệu'!$C$10:$C$1002,\"<=\"&'Thông tin'!$C$13)","v":0},0]
["",null,null,null,null,{"$f":"SUMIFS('Nhập liệu'!$H$10:$H$1002,'Nhập liệu'!$E$10:$E$1002,'Vật tư'!$B145,'Nhập liệu'!$C$10:$C$1002,\">=\"&'Thông tin'!$C$12,'Nhập liệu'!$C$10:$C$1002,\"<=\"&'Thông tin'!$C$13)","v":0},{"$f":"SUMIFS('Nhập liệu'!$I$10:$I$1002,'Nhập liệu'!$E$10:$E$1002,'Vật tư'!$B145,'Nhập liệu'!$C$10:$C$1002,\">=\"&'Thông tin'!$C$12,'Nhập liệu'!$C$10:$C$1002,\"<=\"&'Thông tin'!$C$13)","v":0},0]
["",null,null,null,null,{"$f":"SUMIFS('Nhập liệu'!$H$10:$H$1002,'Nhập liệu'!$E$10:$E$1002,'Vật tư'!$B146,'Nhập liệu'!$C$10:$C$1002,\">=\"&'Thông tin'!$C$12,'Nhập liệu'!$C$10:$C$1002,\"<=\"&'Thông tin'!$C$13)","v":0},{"$f":"SUMIFS('Nhập liệu'!$I$10:$I$1002,'Nhập liệu'!$E$10:$E$1002,'Vật tư'!$B146,'Nhập liệu'!$C$10:$C$1002,\">=\"&'Thông tin'!$C$12,'Nhập liệu'!$C$10:$C$1002,\"<=\"&'Thông tin'!$C$13)","v":0},0]
["",null,null,null,null,{"$f":"SUMIFS('Nhập liệu'!$H$10:$H$1002,'Nhập liệu'!$E$10:$E$1002,'Vật tư'!$B147,'Nhập liệu'!$C$10:$C$1002,\">=\"&'Thông tin'!$C$12,'Nhập liệu'!$C$10:$C$1002,\"<=\"&'Thông tin'!$C$13)","v":0},{"$f":"SUMIFS('Nhập liệu'!$I$10:$I$1002,'Nhập liệu'!$E$10:$E$1002,'Vật tư'!$B147,'Nhập liệu'!$C$10:$C$1002,\">=\"&'Thông tin'!$C$12,'Nhập liệu'!$C$10:$C$1002,\"<=\"&'Thông tin'!$C$13)","v":0},0]
["",null,null,null,null,{"$f":"SUMIFS('Nhập liệu'!$H$10:$H$1002,'Nhập liệu'!$E$10:$E$1002,'Vật tư'!$B148,'Nhập liệu'!$C$10:$C$1002,\">=\"&'Thông tin'!$C$12,'Nhập liệu'!$C$10:$C$1002,\"<=\"&'Thông tin'!$C$13)","v":0},{"$f":"SUMIFS('Nhập liệu'!$I$10:$I$1002,'Nhập liệu'!$E$10:$E$1002,'Vật tư'!$B148,'Nhập liệu'!$C$10:$C$1002,\">=\"&'Thông tin'!$C$12,'Nhập liệu'!$C$10:$C$1002,\"<=\"&'Thông tin'!$C$13)","v":0},0]
["",null,null,null,null,{"$f":"SUMIFS('Nhập liệu'!$H$10:$H$1002,'Nhập liệu'!$E$10:$E$1002,'Vật tư'!$B149,'Nhập liệu'!$C$10:$C$1002,\">=\"&'Thông tin'!$C$12,'Nhập liệu'!$C$10:$C$1002,\"<=\"&'Thông tin'!$C$13)","v":0},{"$f":"SUMIFS('Nhập liệu'!$I$10:$I$1002,'Nhập liệu'!$E$10:$E$1002,'Vật tư'!$B149,'Nhập liệu'!$C$10:$C$1002,\">=\"&'Thông tin'!$C$12,'Nhập liệu'!$C$10:$C$1002,\"<=\"&'Thông tin'!$C$13)","v":0},0]
["",null,null,null,null,{"$f":"SUMIFS('Nhập liệu'!$H$10:$H$1002,'Nhập liệu'!$E$10:$E$1002,'Vật tư'!$B150,'Nhập liệu'!$C$10:$C$1002,\">=\"&'Thông tin'!$C$12,'Nhập liệu'!$C$10:$C$1002,\"<=\"&'Thông tin'!$C$13)","v":0},{"$f":"SUMIFS('Nhập liệu'!$I$10:$I$1002,'Nhập liệu'!$E$10:$E$1002,'Vật tư'!$B150,'Nhập liệu'!$C$10:$C$1002,\">=\"&'Thông tin'!$C$12,'Nhập liệu'!$C$10:$C$1002,\"<=\"&'Thông tin'!$C$13)","v":0},0]
["",null,null,null,null,{"$f":"SUMIFS('Nhập liệu'!$H$10:$H$1002,'Nhập liệu'!$E$10:$E$1002,'Vật tư'!$B151,'Nhập liệu'!$C$10:$C$1002,\">=\"&'Thông tin'!$C$12,'Nhập liệu'!$C$10:$C$1002,\"<=\"&'Thông tin'!$C$13)","v":0},{"$f":"SUMIFS('Nhập liệu'!$I$10:$I$1002,'Nhập liệu'!$E$10:$E$1002,'Vật tư'!$B151,'Nhập liệu'!$C$10:$C$1002,\">=\"&'Thông tin'!$C$12,'Nhập liệu'!$C$10:$C$1002,\"<=\"&'Thông tin'!$C$13)","v":0},0]
["",null,null,null,null,{"$f":"SUMIFS('Nhập liệu'!$H$10:$H$1002,'Nhập liệu'!$E$10:$E$1002,'Vật tư'!$B152,'Nhập liệu'!$C$10:$C$1002,\">=\"&'Thông tin'!$C$12,'Nhập liệu'!$C$10:$C$1002,\"<=\"&'Thông tin'!$C$13)","v":0},{"$f":"SUMIFS('Nhập liệu'!$I$10:$I$1002,'Nhập liệu'!$E$10:$E$1002,'Vật tư'!$B152,'Nhập liệu'!$C$10:$C$1002,\">=\"&'Thông tin'!$C$12,'Nhập liệu'!$C$10:$C$1002,\"<=\"&'Thông tin'!$C$13)","v":0},0]
["",null,null,null,null,{"$f":"SUMIFS('Nhập liệu'!$H$10:$H$1002,'Nhập liệu'!$E$10:$E$1002,'Vật tư'!$B153,'Nhập liệu'!$C$10:$C$1002,\">=\"&'Thông tin'!$C$12,'Nhập liệu'!$C$10:$C$1002,\"<=\"&'Thông tin'!$C$13)","v":0},{"$f":"SUMIFS('Nhập liệu'!$I$10:$I$1002,'Nhập liệu'!$E$10:$E$1002,'Vật tư'!$B153,'Nhập liệu'!$C$10:$C$1002,\">=\"&'Thông tin'!$C$12,'Nhập liệu'!$C$10:$C$1002,\"<=\"&'Thông tin'!$C$13)","v":0},0]
["",null,null,null,null,{"$f":"SUMIFS('Nhập liệu'!$H$10:$H$1002,'Nhập liệu'!$E$10:$E$1002,'Vật tư'!$B154,'Nhập liệu'!$C$10:$C$1002,\">=\"&'Thông tin'!$C$12,'Nhập liệu'!$C$10:$C$1002,\"<=\"&'Thông tin'!$C$13)","v":0},{"$f":"SUMIFS('Nhập liệu'!$I$10:$I$1002,'Nhập liệu'!$E$10:$E$1002,'Vật tư'!$B154,'Nhập liệu'!$C$10:$C$1002,\">=\"&'Thông tin'!$C$12,'Nhập liệu'!$C$10:$C$1002,\"<=\"&'Thông tin'!$C$13)","v":0},0]
["",null,null,null,null,{"$f":"SUMIFS('Nhập liệu'!$H$10:$H$1002,'Nhập liệu'!$E$10:$E$1002,'Vật tư'!$B155,'Nhập liệu'!$C$10:$C$1002,\">=\"&'Thông tin'!$C$12,'Nhập liệu'!$C$10:$C$1002,\"<=\"&'Thông tin'!$C$13)","v":0},{"$f":"SUMIFS('Nhập liệu'!$I$10:$I$1002,'Nhập liệu'!$E$10:$E$1002,'Vật tư'!$B155,'Nhập liệu'!$C$10:$C$1002,\">=\"&'Thông tin'!$C$12,'Nhập liệu'!$C$10:$C$1002,\"<=\"&'Thông tin'!$C$13)","v":0},0]
["",null,null,null,null,{"$f":"SUMIFS('Nhập liệu'!$H$10:$H$1002,'Nhập liệu'!$E$10:$E$1002,'Vật tư'!$B156,'Nhập liệu'!$C$10:$C$1002,\">=\"&'Thông tin'!$C$12,'Nhập liệu'!$C$10:$C$1002,\"<=\"&'Thông tin'!$C$13)","v":0},{"$f":"SUMIFS('Nhập liệu'!$I$10:$I$1002,'Nhập liệu'!$E$10:$E$1002,'Vật tư'!$B156,'Nhập liệu'!$C$10:$C$1002,\">=\"&'Thông tin'!$C$12,'Nhập liệu'!$C$10:$C$1002,\"<=\"&'Thông tin'!$C$13)","v":0},0]
["",null,null,null,null,{"$f":"SUMIFS('Nhập liệu'!$H$10:$H$1002,'Nhập liệu'!$E$10:$E$1002,'Vật tư'!$B157,'Nhập liệu'!$C$10:$C$1002,\">=\"&'Thông tin'!$C$12,'Nhập liệu'!$C$10:$C$1002,\"<=\"&'Thông tin'!$C$13)","v":0},{"$f":"SUMIFS('Nhập liệu'!$I$10:$I$1002,'Nhập liệu'!$E$10:$E$1002,'Vật tư'!$B157,'Nhập liệu'!$C$10:$C$1002,\">=\"&'Thông tin'!$C$12,'Nhập liệu'!$C$10:$C$1002,\"<=\"&'Thông tin'!$C$13)","v":0},0]
["",null,null,null,null,{"$f":"SUMIFS('Nhập liệu'!$H$10:$H$1002,'Nhập liệu'!$E$10:$E$1002,'Vật tư'!$B158,'Nhập liệu'!$C$10:$C$1002,\">=\"&'Thông tin'!$C$12,'Nhập liệu'!$C$10:$C$1002,\"<=\"&'Thông tin'!$C$13)","v":0},{"$f":"SUMIFS('Nhập liệu'!$I$10:$I$1002,'Nhập liệu'!$E$10:$E$1002,'Vật tư'!$B158,'Nhập liệu'!$C$10:$C$1002,\">=\"&'Thông tin'!$C$12,'Nhập liệu'!$C$10:$C$1002,\"<=\"&'Thông tin'!$C$13)","v":0},0]
["",null,null,null,null,{"$f":"SUMIFS('Nhập liệu'!$H$10:$H$1002,'Nhập liệu'!$E$10:$E$1002,'Vật tư'!$B159,'Nhập liệu'!$C$10:$C$1002,\">=\"&'Thông tin'!$C$12,'Nhập liệu'!$C$10:$C$1002,\"<=\"&'Thông tin'!$C$13)","v":0},{"$f":"SUMIFS('Nhập liệu'!$I$10:$I$1002,'Nhập liệu'!$E$10:$E$1002,'Vật tư'!$B159,'Nhập liệu'!$C$10:$C$1002,\">=\"&'Thông tin'!$C$12,'Nhập liệu'!$C$10:$C$1002,\"<=\"&'Thông tin'!$C$13)","v":0},0]
["",null,null,null,null,{"$f":"SUMIFS('Nhập liệu'!$H$10:$H$1002,'Nhập liệu'!$E$10:$E$1002,'Vật tư'!$B160,'Nhập liệu'!$C$10:$C$1002,\">=\"&'Thông tin'!$C$12,'Nhập liệu'!$C$10:$C$1002,\"<=\"&'Thông tin'!$C$13)","v":0},{"$f":"SUMIFS('Nhập liệu'!$I$10:$I$1002,'Nhập liệu'!$E$10:$E$1002,'Vật tư'!$B160,'Nhập liệu'!$C$10:$C$1002,\">=\"&'Thông tin'!$C$12,'Nhập liệu'!$C$10:$C$1002,\"<=\"&'Thông tin'!$C$13)","v":0},0]
["",null,null,null,null,{"$f":"SUMIFS('Nhập liệu'!$H$10:$H$1002,'Nhập liệu'!$E$10:$E$1002,'Vật tư'!$B161,'Nhập liệu'!$C$10:$C$1002,\">=\"&'Thông tin'!$C$12,'Nhập liệu'!$C$10:$C$1002,\"<=\"&'Thông tin'!$C$13)","v":0},{"$f":"SUMIFS('Nhập liệu'!$I$10:$I$1002,'Nhập liệu'!$E$10:$E$1002,'Vật tư'!$B161,'Nhập liệu'!$C$10:$C$1002,\">=\"&'Thông tin'!$C$12,'Nhập liệu'!$C$10:$C$1002,\"<=\"&'Thông tin'!$C$13)","v":0},0]
["",null,null,null,null,{"$f":"SUMIFS('Nhập liệu'!$H$10:$H$1002,'Nhập liệu'!$E$10:$E$1002,'Vật tư'!$B162,'Nhập liệu'!$C$10:$C$1002,\">=\"&'Thông tin'!$C$12,'Nhập liệu'!$C$10:$C$1002,\"<=\"&'Thông tin'!$C$13)","v":0},{"$f":"SUMIFS('Nhập liệu'!$I$10:$I$1002,'Nhập liệu'!$E$10:$E$1002,'Vật tư'!$B162,'Nhập liệu'!$C$10:$C$1002,\">=\"&'Thông tin'!$C$12,'Nhập liệu'!$C$10:$C$1002,\"<=\"&'Thông tin'!$C$13)","v":0},0]
["",null,null,null,null,{"$f":"SUMIFS('Nhập liệu'!$H$10:$H$1002,'Nhập liệu'!$E$10:$E$1002,'Vật tư'!$B163,'Nhập liệu'!$C$10:$C$1002,\">=\"&'Thông tin'!$C$12,'Nhập liệu'!$C$10:$C$1002,\"<=\"&'Thông tin'!$C$13)","v":0},{"$f":"SUMIFS('Nhập liệu'!$I$10:$I$1002,'Nhập liệu'!$E$10:$E$1002,'Vật tư'!$B163,'Nhập liệu'!$C$10:$C$1002,\">=\"&'Thông tin'!$C$12,'Nhập liệu'!$C$10:$C$1002,\"<=\"&'Thông tin'!$C$13)","v":0},0]
["",null,null,null,null,{"$f":"SUMIFS('Nhập liệu'!$H$10:$H$1002,'Nhập liệu'!$E$10:$E$1002,'Vật tư'!$B164,'Nhập liệu'!$C$10:$C$1002,\">=\"&'Thông tin'!$C$12,'Nhập liệu'!$C$10:$C$1002,\"<=\"&'Thông tin'!$C$13)","v":0},{"$f":"SUMIFS('Nhập liệu'!$I$10:$I$1002,'Nhập liệu'!$E$10:$E$1002,'Vật tư'!$B164,'Nhập liệu'!$C$10:$C$1002,\">=\"&'Thông tin'!$C$12,'Nhập liệu'!$C$10:$C$1002,\"<=\"&'Thông tin'!$C$13)","v":0},0]
["",null,null,null,null,{"$f":"SUMIFS('Nhập liệu'!$H$10:$H$1002,'Nhập liệu'!$E$10:$E$1002,'Vật tư'!$B165,'Nhập liệu'!$C$10:$C$1002,\">=\"&'Thông tin'!$C$12,'Nhập liệu'!$C$10:$C$1002,\"<=\"&'Thông tin'!$C$13)","v":0},{"$f":"SUMIFS('Nhập liệu'!$I$10:$I$1002,'Nhập liệu'!$E$10:$E$1002,'Vật tư'!$B165,'Nhập liệu'!$C$10:$C$1002,\">=\"&'Thông tin'!$C$12,'Nhập liệu'!$C$10:$C$1002,\"<=\"&'Thông tin'!$C$13)","v":0},0]
["",null,null,null,null,{"$f":"SUMIFS('Nhập liệu'!$H$10:$H$1002,'Nhập liệu'!$E$10:$E$1002,'Vật tư'!$B166,'Nhập liệu'!$C$10:$C$1002,\">=\"&'Thông tin'!$C$12,'Nhập liệu'!$C$10:$C$1002,\"<=\"&'Thông tin'!$C$13)","v":0},{"$f":"SUMIFS('Nhập liệu'!$I$10:$I$1002,'Nhập liệu'!$E$10:$E$1002,'Vật tư'!$B166,'Nhập liệu'!$C$10:$C$1002,\">=\"&'Thông tin'!$C$12,'Nhập liệu'!$C$10:$C$1002,\"<=\"&'Thông tin'!$C$13)","v":0},0]
["",null,null,null,null,{"$f":"SUMIFS('Nhập liệu'!$H$10:$H$1002,'Nhập liệu'!$E$10:$E$1002,'Vật tư'!$B167,'Nhập liệu'!$C$10:$C$1002,\">=\"&'Thông tin'!$C$12,'Nhập liệu'!$C$10:$C$1002,\"<=\"&'Thông tin'!$C$13)","v":0},{"$f":"SUMIFS('Nhập liệu'!$I$10:$I$1002,'Nhập liệu'!$E$10:$E$1002,'Vật tư'!$B167,'Nhập liệu'!$C$10:$C$1002,\">=\"&'Thông tin'!$C$12,'Nhập liệu'!$C$10:$C$1002,\"<=\"&'Thông tin'!$C$13)","v":0},0]
["",null,null,null,null,{"$f":"SUMIFS('Nhập liệu'!$H$10:$H$1002,'Nhập liệu'!$E$10:$E$1002,'Vật tư'!$B168,'Nhập liệu'!$C$10:$C$1002,\">=\"&'Thông tin'!$C$12,'Nhập liệu'!$C$10:$C$1002,\"<=\"&'Thông tin'!$C$13)","v":0},{"$f":"SUMIFS('Nhập liệu'!$I$10:$I$1002,'Nhập liệu'!$E$10:$E$1002,'Vật tư'!$B168,'Nhập liệu'!$C$10:$C$1002,\">=\"&'Thông tin'!$C$12,'Nhập liệu'!$C$10:$C$1002,\"<=\"&'Thông tin'!$C$13)","v":0},0]
["",null,null,null,null,{"$f":"SUMIFS('Nhập liệu'!$H$10:$H$1002,'Nhập liệu'!$E$10:$E$1002,'Vật tư'!$B169,'Nhập liệu'!$C$10:$C$1002,\">=\"&'Thông tin'!$C$12,'Nhập liệu'!$C$10:$C$1002,\"<=\"&'Thông tin'!$C$13)","v":0},{"$f":"SUMIFS('Nhập liệu'!$I$10:$I$1002,'Nhập liệu'!$E$10:$E$1002,'Vật tư'!$B169,'Nhập liệu'!$C$10:$C$1002,\">=\"&'Thông tin'!$C$12,'Nhập liệu'!$C$10:$C$1002,\"<=\"&'Thông tin'!$C$13)","v":0},0]
["",null,null,null,null,{"$f":"SUMIFS('Nhập liệu'!$H$10:$H$1002,'Nhập liệu'!$E$10:$E$1002,'Vật tư'!$B170,'Nhập liệu'!$C$10:$C$1002,\">=\"&'Thông tin'!$C$12,'Nhập liệu'!$C$10:$C$1002,\"<=\"&'Thông tin'!$C$13)","v":0},{"$f":"SUMIFS('Nhập liệu'!$I$10:$I$1002,'Nhập liệu'!$E$10:$E$1002,'Vật tư'!$B170,'Nhập liệu'!$C$10:$C$1002,\">=\"&'Thông tin'!$C$12,'Nhập liệu'!$C$10:$C$1002,\"<=\"&'Thông tin'!$C$13)","v":0},0]
["",null,null,null,null,{"$f":"SUMIFS('Nhập liệu'!$H$10:$H$1002,'Nhập liệu'!$E$10:$E$1002,'Vật tư'!$B171,'Nhập liệu'!$C$10:$C$1002,\">=\"&'Thông tin'!$C$12,'Nhập liệu'!$C$10:$C$1002,\"<=\"&'Thông tin'!$C$13)","v":0},{"$f":"SUMIFS('Nhập liệu'!$I$10:$I$1002,'Nhập liệu'!$E$10:$E$1002,'Vật tư'!$B171,'Nhập liệu'!$C$10:$C$1002,\">=\"&'Thông tin'!$C$12,'Nhập liệu'!$C$10:$C$1002,\"<=\"&'Thông tin'!$C$13)","v":0},0]
["",null,null,null,null,{"$f":"SUMIFS('Nhập liệu'!$H$10:$H$1002,'Nhập liệu'!$E$10:$E$1002,'Vật tư'!$B172,'Nhập liệu'!$C$10:$C$1002,\">=\"&'Thông tin'!$C$12,'Nhập liệu'!$C$10:$C$1002,\"<=\"&'Thông tin'!$C$13)","v":0},{"$f":"SUMIFS('Nhập liệu'!$I$10:$I$1002,'Nhập liệu'!$E$10:$E$1002,'Vật tư'!$B172,'Nhập liệu'!$C$10:$C$1002,\">=\"&'Thông tin'!$C$12,'Nhập liệu'!$C$10:$C$1002,\"<=\"&'Thông tin'!$C$13)","v":0},0]
["",null,null,null,null,{"$f":"SUMIFS('Nhập liệu'!$H$10:$H$1002,'Nhập liệu'!$E$10:$E$1002,'Vật tư'!$B173,'Nhập liệu'!$C$10:$C$1002,\">=\"&'Thông tin'!$C$12,'Nhập liệu'!$C$10:$C$1002,\"<=\"&'Thông tin'!$C$13)","v":0},{"$f":"SUMIFS('Nhập liệu'!$I$10:$I$1002,'Nhập liệu'!$E$10:$E$1002,'Vật tư'!$B173,'Nhập liệu'!$C$10:$C$1002,\">=\"&'Thông tin'!$C$12,'Nhập liệu'!$C$10:$C$1002,\"<=\"&'Thông tin'!$C$13)","v":0},0]
["",null,null,null,null,{"$f":"SUMIFS('Nhập liệu'!$H$10:$H$1002,'Nhập liệu'!$E$10:$E$1002,'Vật tư'!$B174,'Nhập liệu'!$C$10:$C$1002,\">=\"&'Thông tin'!$C$12,'Nhập liệu'!$C$10:$C$1002,\"<=\"&'Thông tin'!$C$13)","v":0},{"$f":"SUMIFS('Nhập liệu'!$I$10:$I$1002,'Nhập liệu'!$E$10:$E$1002,'Vật tư'!$B174,'Nhập liệu'!$C$10:$C$1002,\">=\"&'Thông tin'!$C$12,'Nhập liệu'!$C$10:$C$1002,\"<=\"&'Thông tin'!$C$13)","v":0},0]
["",null,null,null,null,{"$f":"SUMIFS('Nhập liệu'!$H$10:$H$1002,'Nhập liệu'!$E$10:$E$1002,'Vật tư'!$B175,'Nhập liệu'!$C$10:$C$1002,\">=\"&'Thông tin'!$C$12,'Nhập liệu'!$C$10:$C$1002,\"<=\"&'Thông tin'!$C$13)","v":0},{"$f":"SUMIFS('Nhập liệu'!$I$10:$I$1002,'Nhập liệu'!$E$10:$E$1002,'Vật tư'!$B175,'Nhập liệu'!$C$10:$C$1002,\">=\"&'Thông tin'!$C$12,'Nhập liệu'!$C$10:$C$1002,\"<=\"&'Thông tin'!$C$13)","v":0},0]
["",null,null,null,null,{"$f":"SUMIFS('Nhập liệu'!$H$10:$H$1002,'Nhập liệu'!$E$10:$E$1002,'Vật tư'!$B176,'Nhập liệu'!$C$10:$C$1002,\">=\"&'Thông tin'!$C$12,'Nhập liệu'!$C$10:$C$1002,\"<=\"&'Thông tin'!$C$13)","v":0},{"$f":"SUMIFS('Nhập liệu'!$I$10:$I$1002,'Nhập liệu'!$E$10:$E$1002,'Vật tư'!$B176,'Nhập liệu'!$C$10:$C$1002,\">=\"&'Thông tin'!$C$12,'Nhập liệu'!$C$10:$C$1002,\"<=\"&'Thông tin'!$C$13)","v":0},0]
["",null,null,null,null,{"$f":"SUMIFS('Nhập liệu'!$H$10:$H$1002,'Nhập liệu'!$E$10:$E$1002,'Vật tư'!$B177,'Nhập liệu'!$C$10:$C$1002,\">=\"&'Thông tin'!$C$12,'Nhập liệu'!$C$10:$C$1002,\"<=\"&'Thông tin'!$C$13)","v":0},{"$f":"SUMIFS('Nhập liệu'!$I$10:$I$1002,'Nhập liệu'!$E$10:$E$1002,'Vật tư'!$B177,'Nhập liệu'!$C$10:$C$1002,\">=\"&'Thông tin'!$C$12,'Nhập liệu'!$C$10:$C$1002,\"<=\"&'Thông tin'!$C$13)","v":0},0]
["",null,null,null,null,{"$f":"SUMIFS('Nhập liệu'!$H$10:$H$1002,'Nhập liệu'!$E$10:$E$1002,'Vật tư'!$B178,'Nhập liệu'!$C$10:$C$1002,\">=\"&'Thông tin'!$C$12,'Nhập liệu'!$C$10:$C$1002,\"<=\"&'Thông tin'!$C$13)","v":0},{"$f":"SUMIFS('Nhập liệu'!$I$10:$I$1002,'Nhập liệu'!$E$10:$E$1002,'Vật tư'!$B178,'Nhập liệu'!$C$10:$C$1002,\">=\"&'Thông tin'!$C$12,'Nhập liệu'!$C$10:$C$1002,\"<=\"&'Thông tin'!$C$13)","v":0},0]
["",null,null,null,null,{"$f":"SUMIFS('Nhập liệu'!$H$10:$H$1002,'Nhập liệu'!$E$10:$E$1002,'Vật tư'!$B179,'Nhập liệu'!$C$10:$C$1002,\">=\"&'Thông tin'!$C$12,'Nhập liệu'!$C$10:$C$1002,\"<=\"&'Thông tin'!$C$13)","v":0},{"$f":"SUMIFS('Nhập liệu'!$I$10:$I$1002,'Nhập liệu'!$E$10:$E$1002,'Vật tư'!$B179,'Nhập liệu'!$C$10:$C$1002,\">=\"&'Thông tin'!$C$12,'Nhập liệu'!$C$10:$C$1002,\"<=\"&'Thông tin'!$C$13)","v":0},0]
["",null,null,null,null,{"$f":"SUMIFS('Nhập liệu'!$H$10:$H$1002,'Nhập liệu'!$E$10:$E$1002,'Vật tư'!$B180,'Nhập liệu'!$C$10:$C$1002,\">=\"&'Thông tin'!$C$12,'Nhập liệu'!$C$10:$C$1002,\"<=\"&'Thông tin'!$C$13)","v":0},{"$f":"SUMIFS('Nhập liệu'!$I$10:$I$1002,'Nhập liệu'!$E$10:$E$1002,'Vật tư'!$B180,'Nhập liệu'!$C$10:$C$1002,\">=\"&'Thông tin'!$C$12,'Nhập liệu'!$C$10:$C$1002,\"<=\"&'Thông tin'!$C$13)","v":0},0]
["",null,null,null,null,{"$f":"SUMIFS('Nhập liệu'!$H$10:$H$1002,'Nhập liệu'!$E$10:$E$1002,'Vật tư'!$B181,'Nhập liệu'!$C$10:$C$1002,\">=\"&'Thông tin'!$C$12,'Nhập liệu'!$C$10:$C$1002,\"<=\"&'Thông tin'!$C$13)","v":0},{"$f":"SUMIFS('Nhập liệu'!$I$10:$I$1002,'Nhập liệu'!$E$10:$E$1002,'Vật tư'!$B181,'Nhập liệu'!$C$10:$C$1002,\">=\"&'Thông tin'!$C$12,'Nhập liệu'!$C$10:$C$1002,\"<=\"&'Thông tin'!$C$13)","v":0},0]
["",null,null,null,null,{"$f":"SUMIFS('Nhập liệu'!$H$10:$H$1002,'Nhập liệu'!$E$10:$E$1002,'Vật tư'!$B182,'Nhập liệu'!$C$10:$C$1002,\">=\"&'Thông tin'!$C$12,'Nhập liệu'!$C$10:$C$1002,\"<=\"&'Thông tin'!$C$13)","v":0},{"$f":"SUMIFS('Nhập liệu'!$I$10:$I$1002,'Nhập liệu'!$E$10:$E$1002,'Vật tư'!$B182,'Nhập liệu'!$C$10:$C$1002,\">=\"&'Thông tin'!$C$12,'Nhập liệu'!$C$10:$C$1002,\"<=\"&'Thông tin'!$C$13)","v":0},0]
["",null,null,null,null,{"$f":"SUMIFS('Nhập liệu'!$H$10:$H$1002,'Nhập liệu'!$E$10:$E$1002,'Vật tư'!$B183,'Nhập liệu'!$C$10:$C$1002,\">=\"&'Thông tin'!$C$12,'Nhập liệu'!$C$10:$C$1002,\"<=\"&'Thông tin'!$C$13)","v":0},{"$f":"SUMIFS('Nhập liệu'!$I$10:$I$1002,'Nhập liệu'!$E$10:$E$1002,'Vật tư'!$B183,'Nhập liệu'!$C$10:$C$1002,\">=\"&'Thông tin'!$C$12,'Nhập liệu'!$C$10:$C$1002,\"<=\"&'Thông tin'!$C$13)","v":0},0]
["",null,null,null,null,{"$f":"SUMIFS('Nhập liệu'!$H$10:$H$1002,'Nhập liệu'!$E$10:$E$1002,'Vật tư'!$B184,'Nhập liệu'!$C$10:$C$1002,\">=\"&'Thông tin'!$C$12,'Nhập liệu'!$C$10:$C$1002,\"<=\"&'Thông tin'!$C$13)","v":0},{"$f":"SUMIFS('Nhập liệu'!$I$10:$I$1002,'Nhập liệu'!$E$10:$E$1002,'Vật tư'!$B184,'Nhập liệu'!$C$10:$C$1002,\">=\"&'Thông tin'!$C$12,'Nhập liệu'!$C$10:$C$1002,\"<=\"&'Thông tin'!$C$13)","v":0},0]
["",null,null,null,null,{"$f":"SUMIFS('Nhập liệu'!$H$10:$H$1002,'Nhập liệu'!$E$10:$E$1002,'Vật tư'!$B185,'Nhập liệu'!$C$10:$C$1002,\">=\"&'Thông tin'!$C$12,'Nhập liệu'!$C$10:$C$1002,\"<=\"&'Thông tin'!$C$13)","v":0},{"$f":"SUMIFS('Nhập liệu'!$I$10:$I$1002,'Nhập liệu'!$E$10:$E$1002,'Vật tư'!$B185,'Nhập liệu'!$C$10:$C$1002,\">=\"&'Thông tin'!$C$12,'Nhập liệu'!$C$10:$C$1002,\"<=\"&'Thông tin'!$C$13)","v":0},0]
["",null,null,null,null,{"$f":"SUMIFS('Nhập liệu'!$H$10:$H$1002,'Nhập liệu'!$E$10:$E$1002,'Vật tư'!$B186,'Nhập liệu'!$C$10:$C$1002,\">=\"&'Thông tin'!$C$12,'Nhập liệu'!$C$10:$C$1002,\"<=\"&'Thông tin'!$C$13)","v":0},{"$f":"SUMIFS('Nhập liệu'!$I$10:$I$1002,'Nhập liệu'!$E$10:$E$1002,'Vật tư'!$B186,'Nhập liệu'!$C$10:$C$1002,\">=\"&'Thông tin'!$C$12,'Nhập liệu'!$C$10:$C$1002,\"<=\"&'Thông tin'!$C$13)","v":0},0]
["",null,null,null,null,{"$f":"SUMIFS('Nhập liệu'!$H$10:$H$1002,'Nhập liệu'!$E$10:$E$1002,'Vật tư'!$B187,'Nhập liệu'!$C$10:$C$1002,\">=\"&'Thông tin'!$C$12,'Nhập liệu'!$C$10:$C$1002,\"<=\"&'Thông tin'!$C$13)","v":0},{"$f":"SUMIFS('Nhập liệu'!$I$10:$I$1002,'Nhập liệu'!$E$10:$E$1002,'Vật tư'!$B187,'Nhập liệu'!$C$10:$C$1002,\">=\"&'Thông tin'!$C$12,'Nhập liệu'!$C$10:$C$1002,\"<=\"&'Thông tin'!$C$13)","v":0},0]
["",null,null,null,null,{"$f":"SUMIFS('Nhập liệu'!$H$10:$H$1002,'Nhập liệu'!$E$10:$E$1002,'Vật tư'!$B188,'Nhập liệu'!$C$10:$C$1002,\">=\"&'Thông tin'!$C$12,'Nhập liệu'!$C$10:$C$1002,\"<=\"&'Thông tin'!$C$13)","v":0},{"$f":"SUMIFS('Nhập liệu'!$I$10:$I$1002,'Nhập liệu'!$E$10:$E$1002,'Vật tư'!$B188,'Nhập liệu'!$C$10:$C$1002,\">=\"&'Thông tin'!$C$12,'Nhập liệu'!$C$10:$C$1002,\"<=\"&'Thông tin'!$C$13)","v":0},0]
["",null,null,null,null,{"$f":"SUMIFS('Nhập liệu'!$H$10:$H$1002,'Nhập liệu'!$E$10:$E$1002,'Vật tư'!$B189,'Nhập liệu'!$C$10:$C$1002,\">=\"&'Thông tin'!$C$12,'Nhập liệu'!$C$10:$C$1002,\"<=\"&'Thông tin'!$C$13)","v":0},{"$f":"SUMIFS('Nhập liệu'!$I$10:$I$1002,'Nhập liệu'!$E$10:$E$1002,'Vật tư'!$B189,'Nhập liệu'!$C$10:$C$1002,\">=\"&'Thông tin'!$C$12,'Nhập liệu'!$C$10:$C$1002,\"<=\"&'Thông tin'!$C$13)","v":0},0]
["",null,null,null,null,{"$f":"SUMIFS('Nhập liệu'!$H$10:$H$1002,'Nhập liệu'!$E$10:$E$1002,'Vật tư'!$B190,'Nhập liệu'!$C$10:$C$1002,\">=\"&'Thông tin'!$C$12,'Nhập liệu'!$C$10:$C$1002,\"<=\"&'Thông tin'!$C$13)","v":0},{"$f":"SUMIFS('Nhập liệu'!$I$10:$I$1002,'Nhập liệu'!$E$10:$E$1002,'Vật tư'!$B190,'Nhập liệu'!$C$10:$C$1002,\">=\"&'Thông tin'!$C$12,'Nhập liệu'!$C$10:$C$1002,\"<=\"&'Thông tin'!$C$13)","v":0},0]
["",null,null,null,null,{"$f":"SUMIFS('Nhập liệu'!$H$10:$H$1002,'Nhập liệu'!$E$10:$E$1002,'Vật tư'!$B191,'Nhập liệu'!$C$10:$C$1002,\">=\"&'Thông tin'!$C$12,'Nhập liệu'!$C$10:$C$1002,\"<=\"&'Thông tin'!$C$13)","v":0},{"$f":"SUMIFS('Nhập liệu'!$I$10:$I$1002,'Nhập liệu'!$E$10:$E$1002,'Vật tư'!$B191,'Nhập liệu'!$C$10:$C$1002,\">=\"&'Thông tin'!$C$12,'Nhập liệu'!$C$10:$C$1002,\"<=\"&'Thông tin'!$C$13)","v":0},0]
["",null,null,null,null,{"$f":"SUMIFS('Nhập liệu'!$H$10:$H$1002,'Nhập liệu'!$E$10:$E$1002,'Vật tư'!$B192,'Nhập liệu'!$C$10:$C$1002,\">=\"&'Thông tin'!$C$12,'Nhập liệu'!$C$10:$C$1002,\"<=\"&'Thông tin'!$C$13)","v":0},{"$f":"SUMIFS('Nhập liệu'!$I$10:$I$1002,'Nhập liệu'!$E$10:$E$1002,'Vật tư'!$B192,'Nhập liệu'!$C$10:$C$1002,\">=\"&'Thông tin'!$C$12,'Nhập liệu'!$C$10:$C$1002,\"<=\"&'Thông tin'!$C$13)","v":0},0]
["",null,null,null,null,{"$f":"SUMIFS('Nhập liệu'!$H$10:$H$1002,'Nhập liệu'!$E$10:$E$1002,'Vật tư'!$B193,'Nhập liệu'!$C$10:$C$1002,\">=\"&'Thông tin'!$C$12,'Nhập liệu'!$C$10:$C$1002,\"<=\"&'Thông tin'!$C$13)","v":0},{"$f":"SUMIFS('Nhập liệu'!$I$10:$I$1002,'Nhập liệu'!$E$10:$E$1002,'Vật tư'!$B193,'Nhập liệu'!$C$10:$C$1002,\">=\"&'Thông tin'!$C$12,'Nhập liệu'!$C$10:$C$1002,\"<=\"&'Thông tin'!$C$13)","v":0},0]
["",null,null,null,null,{"$f":"SUMIFS('Nhập liệu'!$H$10:$H$1002,'Nhập liệu'!$E$10:$E$1002,'Vật tư'!$B194,'Nhập liệu'!$C$10:$C$1002,\">=\"&'Thông tin'!$C$12,'Nhập liệu'!$C$10:$C$1002,\"<=\"&'Thông tin'!$C$13)","v":0},{"$f":"SUMIFS('Nhập liệu'!$I$10:$I$1002,'Nhập liệu'!$E$10:$E$1002,'Vật tư'!$B194,'Nhập liệu'!$C$10:$C$1002,\">=\"&'Thông tin'!$C$12,'Nhập liệu'!$C$10:$C$1002,\"<=\"&'Thông tin'!$C$13)","v":0},0]
["",null,null,null,null,{"$f":"SUMIFS('Nhập liệu'!$H$10:$H$1002,'Nhập liệu'!$E$10:$E$1002,'Vật tư'!$B195,'Nhập liệu'!$C$10:$C$1002,\">=\"&'Thông tin'!$C$12,'Nhập liệu'!$C$10:$C$1002,\"<=\"&'Thông tin'!$C$13)","v":0},{"$f":"SUMIFS('Nhập liệu'!$I$10:$I$1002,'Nhập liệu'!$E$10:$E$1002,'Vật tư'!$B195,'Nhập liệu'!$C$10:$C$1002,\">=\"&'Thông tin'!$C$12,'Nhập liệu'!$C$10:$C$1002,\"<=\"&'Thông tin'!$C$13)","v":0},0]
["",null,null,null,null,{"$f":"SUMIFS('Nhập liệu'!$H$10:$H$1002,'Nhập liệu'!$E$10:$E$1002,'Vật tư'!$B196,'Nhập liệu'!$C$10:$C$1002,\">=\"&'Thông tin'!$C$12,'Nhập liệu'!$C$10:$C$1002,\"<=\"&'Thông tin'!$C$13)","v":0},{"$f":"SUMIFS('Nhập liệu'!$I$10:$I$1002,'Nhập liệu'!$E$10:$E$1002,'Vật tư'!$B196,'Nhập liệu'!$C$10:$C$1002,\">=\"&'Thông tin'!$C$12,'Nhập liệu'!$C$10:$C$1002,\"<=\"&'Thông tin'!$C$13)","v":0},0]
["",null,null,null,null,{"$f":"SUMIFS('Nhập liệu'!$H$10:$H$1002,'Nhập liệu'!$E$10:$E$1002,'Vật tư'!$B197,'Nhập liệu'!$C$10:$C$1002,\">=\"&'Thông tin'!$C$12,'Nhập liệu'!$C$10:$C$1002,\"<=\"&'Thông tin'!$C$13)","v":0},{"$f":"SUMIFS('Nhập liệu'!$I$10:$I$1002,'Nhập liệu'!$E$10:$E$1002,'Vật tư'!$B197,'Nhập liệu'!$C$10:$C$1002,\">=\"&'Thông tin'!$C$12,'Nhập liệu'!$C$10:$C$1002,\"<=\"&'Thông tin'!$C$13)","v":0},0]
["",null,null,null,null,{"$f":"SUMIFS('Nhập liệu'!$H$10:$H$1002,'Nhập liệu'!$E$10:$E$1002,'Vật tư'!$B198,'Nhập liệu'!$C$10:$C$1002,\">=\"&'Thông tin'!$C$12,'Nhập liệu'!$C$10:$C$1002,\"<=\"&'Thông tin'!$C$13)","v":0},{"$f":"SUMIFS('Nhập liệu'!$I$10:$I$1002,'Nhập liệu'!$E$10:$E$1002,'Vật tư'!$B198,'Nhập liệu'!$C$10:$C$1002,\">=\"&'Thông tin'!$C$12,'Nhập liệu'!$C$10:$C$1002,\"<=\"&'Thông tin'!$C$13)","v":0},0]
["",null,null,null,null,{"$f":"SUMIFS('Nhập liệu'!$H$10:$H$1002,'Nhập liệu'!$E$10:$E$1002,'Vật tư'!$B199,'Nhập liệu'!$C$10:$C$1002,\">=\"&'Thông tin'!$C$12,'Nhập liệu'!$C$10:$C$1002,\"<=\"&'Thông tin'!$C$13)","v":0},{"$f":"SUMIFS('Nhập liệu'!$I$10:$I$1002,'Nhập liệu'!$E$10:$E$1002,'Vật tư'!$B199,'Nhập liệu'!$C$10:$C$1002,\">=\"&'Thông tin'!$C$12,'Nhập liệu'!$C$10:$C$1002,\"<=\"&'Thông tin'!$C$13)","v":0},0]
["",null,null,null,null,{"$f":"SUMIFS('Nhập liệu'!$H$10:$H$1002,'Nhập liệu'!$E$10:$E$1002,'Vật tư'!$B200,'Nhập liệu'!$C$10:$C$1002,\">=\"&'Thông tin'!$C$12,'Nhập liệu'!$C$10:$C$1002,\"<=\"&'Thông tin'!$C$13)","v":0},{"$f":"SUMIFS('Nhập liệu'!$I$10:$I$1002,'Nhập liệu'!$E$10:$E$1002,'Vật tư'!$B200,'Nhập liệu'!$C$10:$C$1002,\">=\"&'Thông tin'!$C$12,'Nhập liệu'!$C$10:$C$1002,\"<=\"&'Thông tin'!$C$13)","v":0},0]
["Ghi chú: Chèn dòng trước khi thêm bản ghi khi đến dòng cuối"]

{"sheet":"Nhà cung cấp","index":2,"n_rows":201,"n_cols":5,"rows_kept":201,"cut":false,"hidden":false,"merged":[[3,0,3,4]]}
[{"$f":"tt_Tên_Công_ty","v":"TỔNG CÔNG TY XD CTGT 6 - CÔNG TY CỔ PHẦN"}]
[{"$f":"tt_Địa_chỉ","v":"127 Đinh Tiên Hoàng, F3, Q.Bình Thạnh, TP.HCM"}]
[{"$f":"\"Tên kho: \"&tt_Tên_Kho","v":"Tên kho: Trạm Trộn BTNN Núi Nhọn"}]
["KHÁCH HÀNG, NHÀ CUNG CẤP"]
[]
["STT","Mã KH","Tên khách hàng, nhà cung cấp","MST","Địa chỉ"]
["stt","makh","tenkhachhang","mst","diachi"]
[1,"KH-00001","Công ty TNHH PuMa",34000000000,"127 Đinh Tiên Hoàng, F3, Q.Bình Thạnh, TP.HCM"]
[2,"KH-00002","Công Ty TNHH Petrolimex",34000000001,"128 Đinh Tiên Hoàng, F3, Q.Bình Thạnh, TP.HCM"]
[3,"KH-00003","Công Ty Hocim",34000000002,"129 Đinh Tiên Hoàng, F3, Q.Bình Thạnh, TP.HCM"]
[4,"KH-00004","Như Ý",34000000003,"130 Đinh Tiên Hoàng, F3, Q.Bình Thạnh, TP.HCM"]
[]
[]
[]
[]
[]
[]
[]
[]
[]
[]
[]
[]
[]
[]
[]
[]
[]
[]
[]
[]
[]
[]
[]
[]
[]
[]
[]
[{"$f":"+IF(OR($A38=\"\",$B39=\"\"),\"\",$A38+1)","v":""}]
[""]
[""]
[""]
[""]
[""]
[""]
[""]
[""]
[""]
[""]
[""]
[""]
[""]
[""]
[""]
[""]
[""]
[""]
[""]
[""]
[""]
[""]
[""]
[""]
[""]
[""]
[""]
[""]
[""]
[""]
[""]
[""]
[""]
[""]
[""]
[""]
[""]
[""]
[""]
[""]
[""]
[""]
[""]
[""]
[""]
[""]
[""]
[""]
[""]
[""]
[""]
[""]
[""]
[""]
[""]
[""]
[""]
[""]
[""]
[""]
[""]
[""]
[""]
[{"$f":"+IF(OR($A102=\"\",$B103=\"\"),\"\",$A102+1)","v":""}]
[""]
[""]
[""]
[""]
[""]
[""]
[""]
[""]
[""]
[""]
[""]
[""]
[""]
[""]
[""]
[""]
[""]
[""]
[""]
[""]
[""]
[""]
[""]
[""]
[""]
[""]
[""]
[""]
[""]
[""]
[""]
[""]
[""]
[""]
[""]
[""]
[""]
[""]
[""]
[""]
[""]
[""]
[""]
[""]
[""]
[""]
[""]
[""]
[""]
[""]
[""]
[""]
[""]
[""]
[""]
[""]
[""]
[""]
[""]
[""]
[""]
[""]
[""]
[{"$f":"+IF(OR($A166=\"\",$B167=\"\"),\"\",$A166+1)","v":""}]
[""]
[""]
[""]
[""]
[""]
[""]
[""]
[""]
[""]
[""]
[""]
[""]
[""]
[""]
[""]
[""]
[""]
[""]
[""]
[""]
[""]
[""]
[""]
[""]
[""]
[""]
[""]
[""]
[""]
[""]
[""]
[""]
[""]
["Ghi chú: Chèn dòng trước khi thêm bản ghi khi đến dòng cuối"]

{"sheet":"Nhập liệu","index":3,"n_rows":1003,"n_cols":12,"rows_kept":1003,"cut":false,"hidden":false,"merged":[[5,8,6,8],[5,4,6,4],[5,5,6,5],[5,0,6,0],[5,6,6,6],[5,1,5,2],[5,3,6,3],[5,7,6,7]]}
[{"$f":"tt_Tên_Công_ty","v":"TỔNG CÔNG TY XD CTGT 6 - CÔNG TY CỔ PHẦN"},null,null,null,null,null,"BẢNG NHẬP LIỆU"]
[{"$f":"tt_Địa_chỉ","v":"127 Đinh Tiên Hoàng, F3, Q.Bình Thạnh, TP.HCM"},null,null,null,null,null,{"$f":"\"Năm: \"&'Thông tin'!C11","v":"Năm: 2014"}]
[{"$f":"\"Tên kho: \"&tt_Tên_Kho","v":"Tên kho: Trạm Trộn BTNN Núi Nhọn"}]
[]
[]
["Ngày ghi \nsổ","Chứng từ",null,"Diễn giải","Mã \nvật tư","Tên vật tư","ĐVT","Nhập","Xuất","Khách hàng, nhà cung cấp"]
[null,"Số \nchứng từ","Ngày \nchứng từ",null,null,null,null,null,null,"Mã hiệu","Tên đầy đủ","Địa chỉ"]
["CỘNG",null,null,null,null,null,null,{"$f":"SUBTOTAL(9,H10:H1001)","v":83173},{"$f":"SUBTOTAL(9,I10:I1001)","v":64244.5}]
["ngay","ct_so","ct_ngay","diengiai","mvt","tenvt","dvt","slnhap","slxuat","ncc_mh","ncc_ten","ncc_diachi"]
["2014-07-17","PN0001",{"$f":"IF(A10=\"\",\"\",A10)","v":"2014-07-17"},"Nhập dầu FO","FO-001","Dầu FO","Lít",20000,null,"KH-00001","Công ty TNHH PuMa","127 Đinh Tiên Hoàng, F3, Q.Bình Thạnh, TP.HCM"]
["2014-07-24","PN0002","2014-07-24","Nhập Cát","CA-001","Cát","M3",33,null,"KH-00002","Công Ty TNHH Petrolimex","128 Đinh Tiên Hoàng, F3, Q.Bình Thạnh, TP.HCM"]
["2014-07-26","PN0003","2014-07-26","Nhập Bột đá Holeim","CA-001","Cát","M3",43,null,"KH-00004","Như Ý","130 Đinh Tiên Hoàng, F3, Q.Bình Thạnh, TP.HCM"]
["2014-08-21","PN0004","2014-08-21","Nhập Cát","CA-001","Cát","M3",101,null,"KH-00002","Công Ty TNHH Petrolimex","128 Đinh Tiên Hoàng, F3, Q.Bình Thạnh, TP.HCM"]
["2014-08-23","PN0005","2014-08-23","Nhập Nhựa đường","ND-001","Nhựa đường Puma","Tấn",11770,null,"KH-00001","Công ty TNHH PuMa","127 Đinh Tiên Hoàng, F3, Q.Bình Thạnh, TP.HCM"]
["2014-08-23","PN0006","2014-08-23","Nhập Cát","CA-001","Cát","M3",101,null,"KH-00003","Công Ty Hocim","129 Đinh Tiên Hoàng, F3, Q.Bình Thạnh, TP.HCM"]
["2014-10-15","PN0007","2014-10-15","Nhập Cát","CA-001","Cát","M3",22,null,"KH-00003","Công Ty Hocim","129 Đinh Tiên Hoàng, F3, Q.Bình Thạnh, TP.HCM"]
["2014-10-23","PN0008","2014-10-23","Nhập Cát","CA-001","Cát","M3",11,null,"KH-00004","Như Ý","130 Đinh Tiên Hoàng, F3, Q.Bình Thạnh, TP.HCM"]
["2014-10-24","PX0001","2014-10-24","Xuất Cát","CA-001","Cát","M3",null,12,"KH-00004","Như Ý","130 Đinh Tiên Hoàng, F3, Q.Bình Thạnh, TP.HCM"]
["2014-10-24","PX0001","2014-10-24","Xuất Bột đá Holeim","BK-001","Bột Khoáng Holeim","Tấn",null,9.5,"KH-00002","Công Ty TNHH Petrolimex","128 Đinh Tiên Hoàng, F3, Q.Bình Thạnh, TP.HCM"]
["2014-10-24","PX0001","2014-10-24","Xuất Nhựa đường","ND-001","Nhựa đường Puma","Tấn",null,10082,"KH-00001","Công ty TNHH PuMa","127 Đinh Tiên Hoàng, F3, Q.Bình Thạnh, TP.HCM"]
["2014-10-24","PX0001","2014-10-24","Xuất dầu FO","FO-001","Dầu FO","Lít",null,11984,"KH-00002","Công Ty TNHH Petrolimex","128 Đinh Tiên Hoàng, F3, Q.Bình Thạnh, TP.HCM"]
["2014-10-24","PX0001","2014-10-24","Xuất Bột đá Holeim","BK-001","Bột Khoáng Holeim","Tấn",null,11,"KH-00002","Công Ty TNHH Petrolimex","128 Đinh Tiên Hoàng, F3, Q.Bình Thạnh, TP.HCM"]
["2014-11-14","PN0009","2014-11-14","Nhập Nhựa đường","ND-001","Nhựa đường Puma","Tấn",15510,null,"KH-00002","Công Ty TNHH Petrolimex","128 Đinh Tiên Hoàng, F3, Q.Bình Thạnh, TP.HCM"]
["2014-11-14","PN0009","2014-11-14","Nhập Nhựa đường","ND-001","Nhựa đường Puma","Tấn",10020,null,"KH-00004","Như Ý","130 Đinh Tiên Hoàng, F3, Q.Bình Thạnh, TP.HCM"]
["2014-11-19","PN0010","2014-11-19","Nhập Bột đá Holeim","BK-001","Bột Khoáng Holeim","Tấn",40,null,"KH-00001","Công ty TNHH PuMa","127 Đinh Tiên Hoàng, F3, Q.Bình Thạnh, TP.HCM"]
["2014-11-19","PX0003","2014-11-19","Xuất Bột đá Holeim","BK-001","Bột Khoáng Holeim","Tấn",null,17,"KH-00002","Công Ty TNHH Petrolimex","128 Đinh Tiên Hoàng, F3, Q.Bình Thạnh, TP.HCM"]
["2014-11-19","PX0003","2014-11-19","Xuất Nhựa đường","ND-001","Nhựa đường Puma","Tấn",null,13000,"KH-00002","Công Ty TNHH Petrolimex","128 Đinh Tiên Hoàng, F3, Q.Bình Thạnh, TP.HCM"]
["2014-11-19","PX0003","2014-11-19","Xuất Cát","CA-001","Cát","M3",null,120,"KH-00003","Công Ty Hocim","129 Đinh Tiên Hoàng, F3, Q.Bình Thạnh, TP.HCM"]
["2014-11-19","PX0003","2014-11-19","Xuất Dầu FO","FO-001","Dầu FO","Lít",null,3243,"KH-00003","Công Ty Hocim","129 Đinh Tiên Hoàng, F3, Q.Bình Thạnh, TP.HCM"]
["2014-11-18","PX0002","2014-11-18","Xuất Nhựa đường","ND-001","Nhựa đường Puma","Tấn",null,290,"KH-00003","Công Ty Hocim","129 Đinh Tiên Hoàng, F3, Q.Bình Thạnh, TP.HCM"]
["2014-11-18","PX0002","2014-11-18","Xuất Bột đá Holeim","BK-001","Bột Khoáng Holeim","Tấn",null,2,"KH-00002","Công Ty TNHH Petrolimex","128 Đinh Tiên Hoàng, F3, Q.Bình Thạnh, TP.HCM"]
["2014-11-18","PX0002","2014-11-18","Xuất Cát","CA-001","Cát","M3",null,1,"KH-00003","Công Ty Hocim","129 Đinh Tiên Hoàng, F3, Q.Bình Thạnh, TP.HCM"]
["2014-11-22","PN0011",{"$f":"IF(A33=\"\",\"\",A33)","v":"2014-11-22"},"Nhập Dầu FO","FO-001","Dầu FO","Lít",9942,null,"KH-00003","Công Ty Hocim","129 Đinh Tiên Hoàng, F3, Q.Bình Thạnh, TP.HCM"]
["2014-11-25","PN0012","2014-11-25","Nhập Nhựa đường","ND-001","Nhựa đường Puma","Tấn",15580,null,"KH-00002","Công Ty TNHH Petrolimex","128 Đinh Tiên Hoàng, F3, Q.Bình Thạnh, TP.HCM"]
["2014-11-26","PX0004","2014-11-26","Xuất Nhựa đường","ND-001","Nhựa đường Puma","Tấn",null,21621,"KH-00002","Công Ty TNHH Petrolimex","128 Đinh Tiên Hoàng, F3, Q.Bình Thạnh, TP.HCM"]
["2014-11-26","PX0004","2014-11-26","Xuất Bột đá Holeim","BK-001","Bột Khoáng Holeim","Tấn",null,30,"KH-00004","Như Ý","130 Đinh Tiên Hoàng, F3, Q.Bình Thạnh, TP.HCM"]
["2014-11-26","PX0004","2014-11-26","Xuất dầu FO","FO-001","Dầu FO","Lít",null,3772,"KH-00002","Công Ty TNHH Petrolimex","128 Đinh Tiên Hoàng, F3, Q.Bình Thạnh, TP.HCM"]
["2014-11-26","PX0004","2014-11-26","Xuất Cát","CA-001","Cát","M3",null,50,"KH-00002","Công Ty TNHH Petrolimex","128 Đinh Tiên Hoàng, F3, Q.Bình Thạnh, TP.HCM"]
[null,null,{"$f":"IF(A39=\"\",\"\",A39)","v":""},null,null,"",""]
[null,null,"",null,null,"",""]
[null,null,"",null,null,"",""]
[null,null,"",null,null,"",""]
[null,null,"",null,null,"",""]
[null,null,"",null,null,"",""]
[null,null,"",null,null,"",""]
[null,null,"",null,null,"",""]
[null,null,"",null,null,"",""]
[null,null,"",null,null,"",""]
[null,null,"",null,null,"",""]
[null,null,"",null,null,"",""]
[null,null,"",null,null,"",""]
[null,null,"",null,null,"",""]
[null,null,"",null,null,"",""]
[null,null,"",null,null,"",""]
[null,null,"",null,null,"",""]
[null,null,"",null,null,"",""]
[null,null,"",null,null,"",""]
[null,null,"",null,null,"",""]
[null,null,"",null,null,"",""]
[null,null,"",null,null,"",""]
[null,null,"",null,null,"",""]
[null,null,"",null,null,"",""]
[null,null,"",null,null,"",""]
[null,null,"",null,null,"",""]
[null,null,"",null,null,"",""]
[null,null,"",null,null,"",""]
[null,null,"",null,null,"",""]
[null,null,"",null,null,"",""]
[null,null,"",null,null,"",""]
[null,null,"",null,null,"",""]
[null,null,"",null,null,"",""]
[null,null,"",null,null,"",""]
[null,null,"",null,null,"",""]
[null,null,"",null,null,"",""]
[null,null,{"$f":"IF(A75=\"\",\"\",A75)","v":""},null,null,"",""]
[null,null,"",null,null,"",""]
[null,null,"",null,null,"",""]
[null,null,"",null,null,"",""]
[null,null,"",null,null,"",""]
[null,null,"",null,null,"",""]
[null,null,"",null,null,"",""]
[null,null,"",null,null,"",""]
[null,null,"",null,null,"",""]
[null,null,"",null,null,"",""]
[null,null,"",null,null,"",""]
[null,null,"",null,null,"",""]
[null,null,"",null,null,"",""]
[null,null,"",null,null,"",""]
[null,null,"",null,null,"",""]
[null,null,"",null,null,"",""]
[null,null,"",null,null,"",""]
[null,null,"",null,null,"",""]
[null,null,"",null,null,"",""]
[null,null,"",null,null,"",""]
[null,null,"",null,null,"",""]
[null,null,"",null,null,"",""]
[null,null,"",null,null,"",""]
[null,null,"",null,null,"",""]
[null,null,"",null,null,"",""]
[null,null,"",null,null,"",""]
[null,null,"",null,null,"",""]
[null,null,"",null,null,"",""]
[null,null,"",null,null,"",""]
[null,null,"",null,null,"",""]
[null,null,"",null,null,"",""]
[null,null,"",null,null,"",""]
[null,null,"",null,null,"",""]
[null,null,"",null,null,"",""]
[null,null,"",null,null,"",""]
[null,null,"",null,null,"",""]
[null,null,"",null,null,"",""]
[null,null,"",null,null,"",""]
[null,null,"",null,null,"",""]
[null,null,"",null,null,"",""]
[null,null,"",null,null,"",""]
[null,null,"",null,null,"",""]
[null,null,"",null,null,"",""]
[null,null,"",null,null,"",""]
[null,null,"",null,null,"",""]
[null,null,"",null,null,"",""]
[null,null,"",null,null,"",""]
[null,null,"",null,null,"",""]
[null,null,"",null,null,"",""]
[null,null,"",null,null,"",""]
[null,null,"",null,null,"",""]
[null,null,"",null,null,"",""]
[null,null,"",null,null,"",""]
[null,null,"",null,null,"",""]
[null,null,"",null,null,"",""]
[null,null,"",null,null,"",""]
[null,null,"",null,null,"",""]
[null,null,"",null,null,"",""]
[null,null,"",null,null,"",""]
[null,null,"",null,null,"",""]
[null,null,"",null,null,"",""]
[null,null,"",null,null,"",""]
[null,null,"",null,null,"",""]
[null,null,"",null,null,"",""]
[null,null,{"$f":"IF(A139=\"\",\"\",A139)","v":""},null,null,"",""]
[null,null,"",null,null,"",""]
[null,null,"",null,null,"",""]
[null,null,"",null,null,"",""]
[null,null,"",null,null,"",""]
[null,null,"",null,null,"",""]
[null,null,"",null,null,"",""]
[null,null,"",null,null,"",""]
[null,null,"",null,null,"",""]
[null,null,"",null,null,"",""]
[null,null,"",null,null,"",""]
[null,null,"",null,null,"",""]
[null,null,"",null,null,"",""]
[null,null,"",null,null,"",""]
[null,null,"",null,null,"",""]
[null,null,"",null,null,"",""]
[null,null,"",null,null,"",""]
[null,null,"",null,null,"",""]
[null,null,"",null,null,"",""]
[null,null,"",null,null,"",""]
[null,null,"",null,null,"",""]
[null,null,"",null,null,"",""]
[null,null,"",null,null,"",""]
[null,null,"",null,null,"",""]
[null,null,"",null,null,"",""]
[null,null,"",null,null,"",""]
[null,null,"",null,null,"",""]
[null,null,"",null,null,"",""]
[null,null,"",null,null,"",""]
[null,null,"",null,null,"",""]
[null,null,"",null,null,"",""]
[null,null,"",null,null,"",""]
[null,null,"",null,null,"",""]
[null,null,"",null,null,"",""]
[null,null,"",null,null,"",""]
[null,null,"",null,null,"",""]
[null,null,"",null,null,"",""]
[null,null,"",null,null,"",""]
[null,null,"",null,null,"",""]
[null,null,"",null,null,"",""]
[null,null,"",null,null,"",""]
[null,null,"",null,null,"",""]
[null,null,"",null,null,"",""]
[null,null,"",null,null,"",""]
[null,null,"",null,null,"",""]
[null,null,"",null,null,"",""]
[null,null,"",null,null,"",""]
[null,null,"",null,null,"",""]
[null,null,"",null,null,"",""]
[null,null,"",null,null,"",""]
[null,null,"",null,null,"",""]
[null,null,"",null,null,"",""]
[null,null,"",null,null,"",""]
[null,null,"",null,null,"",""]
[null,null,"",null,null,"",""]
[null,null,"",null,null,"",""]
[null,null,"",null,null,"",""]
[null,null,"",null,null,"",""]
[null,null,"",null,null,"",""]
[null,null,"",null,null,"",""]
[null,null,"",null,null,"",""]
[null,null,"",null,null,"",""]
[null,null,"",null,null,"",""]
[null,null,"",null,null,"",""]
[null,null,{"$f":"IF(A203=\"\",\"\",A203)","v":""},null,null,"",""]
[null,null,"",null,null,"",""]
[null,null,"",null,null,"",""]
[null,null,"",null,null,"",""]
[null,null,"",null,null,"",""]
[null,null,"",null,null,"",""]
[null,null,"",null,null,"",""]
[null,null,"",null,null,"",""]
[null,null,"",null,null,"",""]
[null,null,"",null,null,"",""]
[null,null,"",null,null,"",""]
[null,null,"",null,null,"",""]
[null,null,"",null,null,"",""]
[null,null,"",null,null,"",""]
[null,null,"",null,null,"",""]
[null,null,"",null,null,"",""]
[null,null,"",null,null,"",""]
[null,null,"",null,null,"",""]
[null,null,"",null,null,"",""]
[null,null,"",null,null,"",""]
[null,null,"",null,null,"",""]
[null,null,"",null,null,"",""]
[null,null,"",null,null,"",""]
[null,null,"",null,null,"",""]
[null,null,"",null,null,"",""]
[null,null,"",null,null,"",""]
[null,null,"",null,null,"",""]
[null,null,"",null,null,"",""]
[null,null,"",null,null,"",""]
[null,null,"",null,null,"",""]
[null,null,"",null,null,"",""]
[null,null,"",null,null,"",""]
[null,null,"",null,null,"",""]
[null,null,"",null,null,"",""]
[null,null,"",null,null,"",""]
[null,null,"",null,null,"",""]
[null,null,"",null,null,"",""]
[null,null,"",null,null,"",""]
[null,null,"",null,null,"",""]
[null,null,"",null,null,"",""]
[null,null,"",null,null,"",""]
[null,null,"",null,null,"",""]
[null,null,"",null,null,"",""]
[null,null,"",null,null,"",""]
[null,null,"",null,null,"",""]
[null,null,"",null,null,"",""]
[null,null,"",null,null,"",""]
[null,null,"",null,null,"",""]
[null,null,"",null,null,"",""]
[null,null,"",null,null,"",""]
[null,null,"",null,null,"",""]
[null,null,"",null,null,"",""]
[null,null,"",null,null,"",""]
[null,null,"",null,null,"",""]
[null,null,"",null,null,"",""]
[null,null,"",null,null,"",""]
[null,null,"",null,null,"",""]
[null,null,"",null,null,"",""]
[null,null,"",null,null,"",""]
[null,null,"",null,null,"",""]
[null,null,"",null,null,"",""]
[null,null,"",null,null,"",""]
[null,null,"",null,null,"",""]
[null,null,"",null,null,"",""]
[null,null,{"$f":"IF(A267=\"\",\"\",A267)","v":""},null,null,"",""]
[null,null,"",null,null,"",""]
[null,null,"",null,null,"",""]
[null,null,"",null,null,"",""]
[null,null,"",null,null,"",""]
[null,null,"",null,null,"",""]
[null,null,"",null,null,"",""]
[null,null,"",null,null,"",""]
[null,null,"",null,null,"",""]
[null,null,"",null,null,"",""]
[null,null,"",null,null,"",""]
[null,null,"",null,null,"",""]
[null,null,"",null,null,"",""]
[null,null,"",null,null,"",""]
[null,null,"",null,null,"",""]
[null,null,"",null,null,"",""]
[null,null,"",null,null,"",""]
[null,null,"",null,null,"",""]
[null,null,"",null,null,"",""]
[null,null,"",null,null,"",""]
[null,null,"",null,null,"",""]
[null,null,"",null,null,"",""]
[null,null,"",null,null,"",""]
[null,null,"",null,null,"",""]
[null,null,"",null,null,"",""]
[null,null,"",null,null,"",""]
[null,null,"",null,null,"",""]
[null,null,"",null,null,"",""]
[null,null,"",null,null,"",""]
[null,null,"",null,null,"",""]
[null,null,"",null,null,"",""]
[null,null,"",null,null,"",""]
[null,null,"",null,null,"",""]
[null,null,"",null,null,"",""]
[null,null,"",null,null,"",""]
[null,null,"",null,null,"",""]
[null,null,"",null,null,"",""]
[null,null,"",null,null,"",""]
[null,null,"",null,null,"",""]
[null,null,"",null,null,"",""]
[null,null,"",null,null,"",""]
[null,null,"",null,null,"",""]
[null,null,"",null,null,"",""]
[null,null,"",null,null,"",""]
[null,null,"",null,null,"",""]
[null,null,"",null,null,"",""]
[null,null,"",null,null,"",""]
[null,null,"",null,null,"",""]
[null,null,"",null,null,"",""]
[null,null,"",null,null,"",""]
[null,null,"",null,null,"",""]
[null,null,"",null,null,"",""]
[null,null,"",null,null,"",""]
[null,null,"",null,null,"",""]
[null,null,"",null,null,"",""]
[null,null,"",null,null,"",""]
[null,null,"",null,null,"",""]
[null,null,"",null,null,"",""]
[null,null,"",null,null,"",""]
[null,null,"",null,null,"",""]
[null,null,"",null,null,"",""]
[null,null,"",null,null,"",""]
[null,null,"",null,null,"",""]
[null,null,"",null,null,"",""]
[null,null,{"$f":"IF(A331=\"\",\"\",A331)","v":""},null,null,"",""]
[null,null,"",null,null,"",""]
[null,null,"",null,null,"",""]
[null,null,"",null,null,"",""]
[null,null,"",null,null,"",""]
[null,null,"",null,null,"",""]
[null,null,"",null,null,"",""]
[null,null,"",null,null,"",""]
[null,null,"",null,null,"",""]
[null,null,"",null,null,"",""]
[null,null,"",null,null,"",""]
[null,null,"",null,null,"",""]
[null,null,"",null,null,"",""]
[null,null,"",null,null,"",""]
[null,null,"",null,null,"",""]
[null,null,"",null,null,"",""]
[null,null,"",null,null,"",""]
[null,null,"",null,null,"",""]
[null,null,"",null,null,"",""]
[null,null,"",null,null,"",""]
[null,null,"",null,null,"",""]
[null,null,"",null,null,"",""]
[null,null,"",null,null,"",""]
[null,null,"",null,null,"",""]
[null,null,"",null,null,"",""]
[null,null,"",null,null,"",""]
[null,null,"",null,null,"",""]
[null,null,"",null,null,"",""]
[null,null,"",null,null,"",""]
[null,null,"",null,null,"",""]
[null,null,"",null,null,"",""]
[null,null,"",null,null,"",""]
[null,null,"",null,null,"",""]
[null,null,"",null,null,"",""]
[null,null,"",null,null,"",""]
[null,null,"",null,null,"",""]
[null,null,"",null,null,"",""]
[null,null,"",null,null,"",""]
[null,null,"",null,null,"",""]
[null,null,"",null,null,"",""]
[null,null,"",null,null,"",""]
[null,null,"",null,null,"",""]
[null,null,"",null,null,"",""]
[null,null,"",null,null,"",""]
[null,null,"",null,null,"",""]
[null,null,"",null,null,"",""]
[null,null,"",null,null,"",""]
[null,null,"",null,null,"",""]
[null,null,"",null,null,"",""]
[null,null,"",null,null,"",""]
[null,null,"",null,null,"",""]
[null,null,"",null,null,"",""]
[null,null,"",null,null,"",""]
[null,null,"",null,null,"",""]
[null,null,"",null,null,"",""]
[null,null,"",null,null,"",""]
[null,null,"",null,null,"",""]
[null,null,"",null,null,"",""]
[null,null,"",null,null,"",""]
[null,null,"",null,null,"",""]
[null,null,"",null,null,"",""]
[null,null,"",null,null,"",""]
[null,null,"",null,null,"",""]
[null,null,"",null,null,"",""]
[null,null,{"$f":"IF(A395=\"\",\"\",A395)","v":""},null,null,"",""]
[null,null,"",null,null,"",""]
[null,null,"",null,null,"",""]
[null,null,"",null,null,"",""]
[null,null,"",null,null,"",""]
[null,null,"",null,null,"",""]
[null,null,"",null,null,"",""]
[null,null,"",null,null,"",""]
[null,null,"",null,null,"",""]
[null,null,"",null,null,"",""]
[null,null,"",null,null,"",""]
[null,null,"",null,null,"",""]
[null,null,"",null,null,"",""]
[null,null,"",null,null,"",""]
[null,null,"",null,null,"",""]
[null,null,"",null,null,"",""]
[null,null,"",null,null,"",""]
[null,null,"",null,null,"",""]
[null,null,"",null,null,"",""]
[null,null,"",null,null,"",""]
[null,null,"",null,null,"",""]
[null,null,"",null,null,"",""]
[null,null,"",null,null,"",""]
[null,null,"",null,null,"",""]
[null,null,"",null,null,"",""]
[null,null,"",null,null,"",""]
[null,null,"",null,null,"",""]
[null,null,"",null,null,"",""]
[null,null,"",null,null,"",""]
[null,null,"",null,null,"",""]
[null,null,"",null,null,"",""]
[null,null,"",null,null,"",""]
[null,null,"",null,null,"",""]
[null,null,"",null,null,"",""]
[null,null,"",null,null,"",""]
[null,null,"",null,null,"",""]
[null,null,"",null,null,"",""]
[null,null,"",null,null,"",""]
[null,null,"",null,null,"",""]
[null,null,"",null,null,"",""]
[null,null,"",null,null,"",""]
[null,null,"",null,null,"",""]
[null,null,"",null,null,"",""]
[null,null,"",null,null,"",""]
[null,null,"",null,null,"",""]
[null,null,"",null,null,"",""]
[null,null,"",null,null,"",""]
[null,null,"",null,null,"",""]
[null,null,"",null,null,"",""]
[null,null,"",null,null,"",""]
[null,null,"",null,null,"",""]
[null,null,"",null,null,"",""]
[null,null,"",null,null,"",""]
[null,null,"",null,null,"",""]
[null,null,"",null,null,"",""]
[null,null,"",null,null,"",""]
[null,null,"",null,null,"",""]
[null,null,"",null,null,"",""]
[null,null,"",null,null,"",""]
[null,null,"",null,null,"",""]
[null,null,"",null,null,"",""]
[null,null,"",null,null,"",""]
[null,null,"",null,null,"",""]
[null,null,"",null,null,"",""]
[null,null,{"$f":"IF(A459=\"\",\"\",A459)","v":""},null,null,"",""]
[null,null,"",null,null,"",""]
[null,null,"",null,null,"",""]
[null,null,"",null,null,"",""]
[null,null,"",null,null,"",""]
[null,null,"",null,null,"",""]
[null,null,"",null,null,"",""]
[null,null,"",null,null,"",""]
[null,null,"",null,null,"",""]
[null,null,"",null,null,"",""]
[null,null,"",null,null,"",""]
[null,null,"",null,null,"",""]
[null,null,"",null,null,"",""]
[null,null,"",null,null,"",""]
[null,null,"",null,null,"",""]
[null,null,"",null,null,"",""]
[null,null,"",null,null,"",""]
[null,null,"",null,null,"",""]
[null,null,"",null,null,"",""]
[null,null,"",null,null,"",""]
[null,null,"",null,null,"",""]
[null,null,"",null,null,"",""]
[null,null,"",null,null,"",""]
[null,null,"",null,null,"",""]
[null,null,"",null,null,"",""]
[null,null,"",null,null,"",""]
[null,null,"",null,null,"",""]
[null,null,"",null,null,"",""]
[null,null,"",null,null,"",""]
[null,null,"",null,null,"",""]
[null,null,"",null,null,"",""]
[null,null,"",null,null,"",""]
[null,null,"",null,null,"",""]
[null,null,"",null,null,"",""]
[null,null,"",null,null,"",""]
[null,null,"",null,null,"",""]
[null,null,"",null,null,"",""]
[null,null,"",null,null,"",""]
[null,null,"",null,null,"",""]
[null,null,"",null,null,"",""]
[null,null,"",null,null,"",""]
[null,null,"",null,null,"",""]
[null,null,"",null,null,"",""]
[null,null,"",null,null,"",""]
[null,null,"",null,null,"",""]
[null,null,"",null,null,"",""]
[null,null,"",null,null,"",""]
[null,null,"",null,null,"",""]
[null,null,"",null,null,"",""]
[null,null,"",null,null,"",""]
[null,null,"",null,null,"",""]
[null,null,"",null,null,"",""]
[null,null,"",null,null,"",""]
[null,null,"",null,null,"",""]
[null,null,"",null,null,"",""]
[null,null,"",null,null,"",""]
[null,null,"",null,null,"",""]
[null,null,"",null,null,"",""]
[null,null,"",null,null,"",""]
[null,null,"",null,null,"",""]
[null,null,"",null,null,"",""]
[null,null,"",null,null,"",""]
[null,null,"",null,null,"",""]
[null,null,"",null,null,"",""]
[null,null,{"$f":"IF(A523=\"\",\"\",A523)","v":""},null,null,"",""]
[null,null,"",null,null,"",""]
[null,null,"",null,null,"",""]
[null,null,"",null,null,"",""]
[null,null,"",null,null,"",""]
[null,null,"",null,null,"",""]
[null,null,"",null,null,"",""]
[null,null,"",null,null,"",""]
[null,null,"",null,null,"",""]
[null,null,"",null,null,"",""]
[null,null,"",null,null,"",""]
[null,null,"",null,null,"",""]
[null,null,"",null,null,"",""]
[null,null,"",null,null,"",""]
[null,null,"",null,null,"",""]
[null,null,"",null,null,"",""]
[null,null,"",null,null,"",""]
[null,null,"",null,null,"",""]
[null,null,"",null,null,"",""]
[null,null,"",null,null,"",""]
[null,null,"",null,null,"",""]
[null,null,"",null,null,"",""]
[null,null,"",null,null,"",""]
[null,null,"",null,null,"",""]
[null,null,"",null,null,"",""]
[null,null,"",null,null,"",""]
[null,null,"",null,null,"",""]
[null,null,"",null,null,"",""]
[null,null,"",null,null,"",""]
[null,null,"",null,null,"",""]
[null,null,"",null,null,"",""]
[null,null,"",null,null,"",""]
[null,null,"",null,null,"",""]
[null,null,"",null,null,"",""]
[null,null,"",null,null,"",""]
[null,null,"",null,null,"",""]
[null,null,"",null,null,"",""]
[null,null,"",null,null,"",""]
[null,null,"",null,null,"",""]
[null,null,"",null,null,"",""]
[null,null,"",null,null,"",""]
[null,null,"",null,null,"",""]
[null,null,"",null,null,"",""]
[null,null,"",null,null,"",""]
[null,null,"",null,null,"",""]
[null,null,"",null,null,"",""]
[null,null,"",null,null,"",""]
[null,null,"",null,null,"",""]
[null,null,"",null,null,"",""]
[null,null,"",null,null,"",""]
[null,null,"",null,null,"",""]
[null,null,"",null,null,"",""]
[null,null,"",null,null,"",""]
[null,null,"",null,null,"",""]
[null,null,"",null,null,"",""]
[null,null,"",null,null,"",""]
[null,null,"",null,null,"",""]
[null,null,"",null,null,"",""]
[null,null,"",null,null,"",""]
[null,null,"",null,null,"",""]
[null,null,"",null,null,"",""]
[null,null,"",null,null,"",""]
[null,null,"",null,null,"",""]
[null,null,"",null,null,"",""]
[null,null,{"$f":"IF(A587=\"\",\"\",A587)","v":""},null,null,"",""]
[null,null,"",null,null,"",""]
[null,null,"",null,null,"",""]
[null,null,"",null,null,"",""]
[null,null,"",null,null,"",""]
[null,null,"",null,null,"",""]
[null,null,"",null,null,"",""]
[null,null,"",null,null,"",""]
[null,null,"",null,null,"",""]
[null,null,"",null,null,"",""]
[null,null,"",null,null,"",""]
[null,null,"",null,null,"",""]
[null,null,"",null,null,"",""]
[null,null,"",null,null,"",""]
[null,null,"",null,null,"",""]
[null,null,"",null,null,"",""]
[null,null,"",null,null,"",""]
[null,null,"",null,null,"",""]
[null,null,"",null,null,"",""]
[null,null,"",null,null,"",""]
[null,null,"",null,null,"",""]
[null,null,"",null,null,"",""]
[null,null,"",null,null,"",""]
[null,null,"",null,null,"",""]
[null,null,"",null,null,"",""]
[null,null,"",null,null,"",""]
[null,null,"",null,null,"",""]
[null,null,"",null,null,"",""]
[null,null,"",null,null,"",""]
[null,null,"",null,null,"",""]
[null,null,"",null,null,"",""]
[null,null,"",null,null,"",""]
[null,null,"",null,null,"",""]
[null,null,"",null,null,"",""]
[null,null,"",null,null,"",""]
[null,null,"",null,null,"",""]
[null,null,"",null,null,"",""]
[null,null,"",null,null,"",""]
[null,null,"",null,null,"",""]
[null,null,"",null,null,"",""]
[null,null,"",null,null,"",""]
[null,null,"",null,null,"",""]
[null,null,"",null,null,"",""]
[null,null,"",null,null,"",""]
[null,null,"",null,null,"",""]
[null,null,"",null,null,"",""]
[null,null,"",null,null,"",""]
[null,null,"",null,null,"",""]
[null,null,"",null,null,"",""]
[null,null,"",null,null,"",""]
[null,null,"",null,null,"",""]
[null,null,"",null,null,"",""]
[null,null,"",null,null,"",""]
[null,null,"",null,null,"",""]
[null,null,"",null,null,"",""]
[null,null,"",null,null,"",""]
[null,null,"",null,null,"",""]
[null,null,"",null,null,"",""]
[null,null,"",null,null,"",""]
[null,null,"",null,null,"",""]
[null,null,"",null,null,"",""]
[null,null,"",null,null,"",""]
[null,null,"",null,null,"",""]
[null,null,"",null,null,"",""]
[null,null,{"$f":"IF(A651=\"\",\"\",A651)","v":""},null,null,"",""]
[null,null,"",null,null,"",""]
[null,null,"",null,null,"",""]
[null,null,"",null,null,"",""]
[null,null,"",null,null,"",""]
[null,null,"",null,null,"",""]
[null,null,"",null,null,"",""]
[null,null,"",null,null,"",""]
[null,null,"",null,null,"",""]
[null,null,"",null,null,"",""]
[null,null,"",null,null,"",""]
[null,null,"",null,null,"",""]
[null,null,"",null,null,"",""]
[null,null,"",null,null,"",""]
[null,null,"",null,null,"",""]
[null,null,"",null,null,"",""]
[null,null,"",null,null,"",""]
[null,null,"",null,null,"",""]
[null,null,"",null,null,"",""]
[null,null,"",null,null,"",""]
[null,null,"",null,null,"",""]
[null,null,"",null,null,"",""]
[null,null,"",null,null,"",""]
[null,null,"",null,null,"",""]
[null,null,"",null,null,"",""]
[null,null,"",null,null,"",""]
[null,null,"",null,null,"",""]
[null,null,"",null,null,"",""]
[null,null,"",null,null,"",""]
[null,null,"",null,null,"",""]
[null,null,"",null,null,"",""]
[null,null,"",null,null,"",""]
[null,null,"",null,null,"",""]
[null,null,"",null,null,"",""]
[null,null,"",null,null,"",""]
[null,null,"",null,null,"",""]
[null,null,"",null,null,"",""]
[null,null,"",null,null,"",""]
[null,null,"",null,null,"",""]
[null,null,"",null,null,"",""]
[null,null,"",null,null,"",""]
[null,null,"",null,null,"",""]
[null,null,"",null,null,"",""]
[null,null,"",null,null,"",""]
[null,null,"",null,null,"",""]
[null,null,"",null,null,"",""]
[null,null,"",null,null,"",""]
[null,null,"",null,null,"",""]
[null,null,"",null,null,"",""]
[null,null,"",null,null,"",""]
[null,null,"",null,null,"",""]
[null,null,"",null,null,"",""]
[null,null,"",null,null,"",""]
[null,null,"",null,null,"",""]
[null,null,"",null,null,"",""]
[null,null,"",null,null,"",""]
[null,null,"",null,null,"",""]
[null,null,"",null,null,"",""]
[null,null,"",null,null,"",""]
[null,null,"",null,null,"",""]
[null,null,"",null,null,"",""]
[null,null,"",null,null,"",""]
[null,null,"",null,null,"",""]
[null,null,"",null,null,"",""]
[null,null,{"$f":"IF(A715=\"\",\"\",A715)","v":""},null,null,"",""]
[null,null,"",null,null,"",""]
[null,null,"",null,null,"",""]
[null,null,"",null,null,"",""]
[null,null,"",null,null,"",""]
[null,null,"",null,null,"",""]
[null,null,"",null,null,"",""]
[null,null,"",null,null,"",""]
[null,null,"",null,null,"",""]
[null,null,"",null,null,"",""]
[null,null,"",null,null,"",""]
[null,null,"",null,null,"",""]
[null,null,"",null,null,"",""]
[null,null,"",null,null,"",""]
[null,null,"",null,null,"",""]
[null,null,"",null,null,"",""]
[null,null,"",null,null,"",""]
[null,null,"",null,null,"",""]
[null,null,"",null,null,"",""]
[null,null,"",null,null,"",""]
[null,null,"",null,null,"",""]
[null,null,"",null,null,"",""]
[null,null,"",null,null,"",""]
[null,null,"",null,null,"",""]
[null,null,"",null,null,"",""]
[null,null,"",null,null,"",""]
[null,null,"",null,null,"",""]
[null,null,"",null,null,"",""]
[null,null,"",null,null,"",""]
[null,null,"",null,null,"",""]
[null,null,"",null,null,"",""]
[null,null,"",null,null,"",""]
[null,null,"",null,null,"",""]
[null,null,"",null,null,"",""]
[null,null,"",null,null,"",""]
[null,null,"",null,null,"",""]
[null,null,"",null,null,"",""]
[null,null,"",null,null,"",""]
[null,null,"",null,null,"",""]
[null,null,"",null,null,"",""]
[null,null,"",null,null,"",""]
[null,null,"",null,null,"",""]
[null,null,"",null,null,"",""]
[null,null,"",null,null,"",""]
[null,null,"",null,null,"",""]
[null,null,"",null,null,"",""]
[null,null,"",null,null,"",""]
[null,null,"",null,null,"",""]
[null,null,"",null,null,"",""]
[null,null,"",null,null,"",""]
[null,null,"",null,null,"",""]
[null,null,"",null,null,"",""]
[null,null,"",null,null,"",""]
[null,null,"",null,null,"",""]
[null,null,"",null,null,"",""]
[null,null,"",null,null,"",""]
[null,null,"",null,null,"",""]
[null,null,"",null,null,"",""]
[null,null,"",null,null,"",""]
[null,null,"",null,null,"",""]
[null,null,"",null,null,"",""]
[null,null,"",null,null,"",""]
[null,null,"",null,null,"",""]
[null,null,"",null,null,"",""]
[null,null,{"$f":"IF(A779=\"\",\"\",A779)","v":""},null,null,"",""]
[null,null,"",null,null,"",""]
[null,null,"",null,null,"",""]
[null,null,"",null,null,"",""]
[null,null,"",null,null,"",""]
[null,null,"",null,null,"",""]
[null,null,"",null,null,"",""]
[null,null,"",null,null,"",""]
[null,null,"",null,null,"",""]
[null,null,"",null,null,"",""]
[null,null,"",null,null,"",""]
[null,null,"",null,null,"",""]
[null,null,"",null,null,"",""]
[null,null,"",null,null,"",""]
[null,null,"",null,null,"",""]
[null,null,"",null,null,"",""]
[null,null,"",null,null,"",""]
[null,null,"",null,null,"",""]
[null,null,"",null,null,"",""]
[null,null,"",null,null,"",""]
[null,null,"",null,null,"",""]
[null,null,"",null,null,"",""]
[null,null,"",null,null,"",""]
[null,null,"",null,null,"",""]
[null,null,"",null,null,"",""]
[null,null,"",null,null,"",""]
[null,null,"",null,null,"",""]
[null,null,"",null,null,"",""]
[null,null,"",null,null,"",""]
[null,null,"",null,null,"",""]
[null,null,"",null,null,"",""]
[null,null,"",null,null,"",""]
[null,null,"",null,null,"",""]
[null,null,"",null,null,"",""]
[null,null,"",null,null,"",""]
[null,null,"",null,null,"",""]
[null,null,"",null,null,"",""]
[null,null,"",null,null,"",""]
[null,null,"",null,null,"",""]
[null,null,"",null,null,"",""]
[null,null,"",null,null,"",""]
[null,null,"",null,null,"",""]
[null,null,"",null,null,"",""]
[null,null,"",null,null,"",""]
[null,null,"",null,null,"",""]
[null,null,"",null,null,"",""]
[null,null,"",null,null,"",""]
[null,null,"",null,null,"",""]
[null,null,"",null,null,"",""]
[null,null,"",null,null,"",""]
[null,null,"",null,null,"",""]
[null,null,"",null,null,"",""]
[null,null,"",null,null,"",""]
[null,null,"",null,null,"",""]
[null,null,"",null,null,"",""]
[null,null,"",null,null,"",""]
[null,null,"",null,null,"",""]
[null,null,"",null,null,"",""]
[null,null,"",null,null,"",""]
[null,null,"",null,null,"",""]
[null,null,"",null,null,"",""]
[null,null,"",null,null,"",""]
[null,null,"",null,null,"",""]
[null,null,"",null,null,"",""]
[null,null,{"$f":"IF(A843=\"\",\"\",A843)","v":""},null,null,"",""]
[null,null,"",null,null,"",""]
[null,null,"",null,null,"",""]
[null,null,"",null,null,"",""]
[null,null,"",null,null,"",""]
[null,null,"",null,null,"",""]
[null,null,"",null,null,"",""]
[null,null,"",null,null,"",""]
[null,null,"",null,null,"",""]
[null,null,"",null,null,"",""]
[null,null,"",null,null,"",""]
[null,null,"",null,null,"",""]
[null,null,"",null,null,"",""]
[null,null,"",null,null,"",""]
[null,null,"",null,null,"",""]
[null,null,"",null,null,"",""]
[null,null,"",null,null,"",""]
[null,null,"",null,null,"",""]
[null,null,"",null,null,"",""]
[null,null,"",null,null,"",""]
[null,null,"",null,null,"",""]
[null,null,"",null,null,"",""]
[null,null,"",null,null,"",""]
[null,null,"",null,null,"",""]
[null,null,"",null,null,"",""]
[null,null,"",null,null,"",""]
[null,null,"",null,null,"",""]
[null,null,"",null,null,"",""]
[null,null,"",null,null,"",""]
[null,null,"",null,null,"",""]
[null,null,"",null,null,"",""]
[null,null,"",null,null,"",""]
[null,null,"",null,null,"",""]
[null,null,"",null,null,"",""]
[null,null,"",null,null,"",""]
[null,null,"",null,null,"",""]
[null,null,"",null,null,"",""]
[null,null,"",null,null,"",""]
[null,null,"",null,null,"",""]
[null,null,"",null,null,"",""]
[null,null,"",null,null,"",""]
[null,null,"",null,null,"",""]
[null,null,"",null,null,"",""]
[null,null,"",null,null,"",""]
[null,null,"",null,null,"",""]
[null,null,"",null,null,"",""]
[null,null,"",null,null,"",""]
[null,null,"",null,null,"",""]
[null,null,"",null,null,"",""]
[null,null,"",null,null,"",""]
[null,null,"",null,null,"",""]
[null,null,"",null,null,"",""]
[null,null,"",null,null,"",""]
[null,null,"",null,null,"",""]
[null,null,"",null,null,"",""]
[null,null,"",null,null,"",""]
[null,null,"",null,null,"",""]
[null,null,"",null,null,"",""]
[null,null,"",null,null,"",""]
[null,null,"",null,null,"",""]
[null,null,"",null,null,"",""]
[null,null,"",null,null,"",""]
[null,null,"",null,null,"",""]
[null,null,"",null,null,"",""]
[null,null,{"$f":"IF(A907=\"\",\"\",A907)","v":""},null,null,"",""]
[null,null,"",null,null,"",""]
[null,null,"",null,null,"",""]
[null,null,"",null,null,"",""]
[null,null,"",null,null,"",""]
[null,null,"",null,null,"",""]
[null,null,"",null,null,"",""]
[null,null,"",null,null,"",""]
[null,null,"",null,null,"",""]
[null,null,"",null,null,"",""]
[null,null,"",null,null,"",""]
[null,null,"",null,null,"",""]
[null,null,"",null,null,"",""]
[null,null,"",null,null,"",""]
[null,null,"",null,null,"",""]
[null,null,"",null,null,"",""]
[null,null,"",null,null,"",""]
[null,null,"",null,null,"",""]
[null,null,"",null,null,"",""]
[null,null,"",null,null,"",""]
[null,null,"",null,null,"",""]
[null,null,"",null,null,"",""]
[null,null,"",null,null,"",""]
[null,null,"",null,null,"",""]
[null,null,"",null,null,"",""]
[null,null,"",null,null,"",""]
[null,null,"",null,null,"",""]
[null,null,"",null,null,"",""]
[null,null,"",null,null,"",""]
[null,null,"",null,null,"",""]
[null,null,"",null,null,"",""]
[null,null,"",null,null,"",""]
[null,null,"",null,null,"",""]
[null,null,"",null,null,"",""]
[null,null,"",null,null,"",""]
[null,null,"",null,null,"",""]
[null,null,"",null,null,"",""]
[null,null,"",null,null,"",""]
[null,null,"",null,null,"",""]
[null,null,"",null,null,"",""]
[null,null,"",null,null,"",""]
[null,null,"",null,null,"",""]
[null,null,"",null,null,"",""]
[null,null,"",null,null,"",""]
[null,null,"",null,null,"",""]
[null,null,"",null,null,"",""]
[null,null,"",null,null,"",""]
[null,null,"",null,null,"",""]
[null,null,"",null,null,"",""]
[null,null,"",null,null,"",""]
[null,null,"",null,null,"",""]
[null,null,"",null,null,"",""]
[null,null,"",null,null,"",""]
[null,null,"",null,null,"",""]
[null,null,"",null,null,"",""]
[null,null,"",null,null,"",""]
[null,null,"",null,null,"",""]
[null,null,"",null,null,"",""]
[null,null,"",null,null,"",""]
[null,null,"",null,null,"",""]
[null,null,"",null,null,"",""]
[null,null,"",null,null,"",""]
[null,null,"",null,null,"",""]
[null,null,"",null,null,"",""]
[null,null,{"$f":"IF(A971=\"\",\"\",A971)","v":""},null,null,"",""]
[null,null,"",null,null,"",""]
[null,null,"",null,null,"",""]
[null,null,"",null,null,"",""]
[null,null,"",null,null,"",""]
[null,null,"",null,null,"",""]
[null,null,"",null,null,"",""]
[null,null,"",null,null,"",""]
[null,null,"",null,null,"",""]
[null,null,"",null,null,"",""]
[null,null,"",null,null,"",""]
[null,null,"",null,null,"",""]
[null,null,"",null,null,"",""]
[null,null,"",null,null,"",""]
[null,null,"",null,null,"",""]
[null,null,"",null,null,"",""]
[null,null,"",null,null,"",""]
[null,null,"",null,null,"",""]
[null,null,"",null,null,"",""]
[null,null,"",null,null,"",""]
[null,null,"",null,null,"",""]
[null,null,"",null,null,"",""]
[null,null,"",null,null,"",""]
[null,null,"",null,null,"",""]
[null,null,"",null,null,"",""]
[null,null,"",null,null,"",""]
[null,null,"",null,null,"",""]
[null,null,"",null,null,"",""]
[null,null,"",null,null,"",""]
[null,null,"",null,null,"",""]
[null,null,"",null,null,"",""]
[null,null,null,null,null,""]
["Ghi chú: Chèn dòng trước khi thêm bản ghi khi đến dòng cuối"]

{"sheet":"Nhập-Xuất-Tồn","index":4,"n_rows":25,"n_cols":7,"rows_kept":25,"cut":false,"hidden":false,"merged":[[4,0,4,6],[19,4,19,6],[24,4,24,6],[19,0,19,1],[24,0,24,1],[16,0,16,2],[18,3,18,6]]}
[{"$f":"tt_Tên_Công_ty","v":"TỔNG CÔNG TY XD CTGT 6 - CÔNG TY CỔ PHẦN"}]
[{"$f":"tt_Địa_chỉ","v":"127 Đinh Tiên Hoàng, F3, Q.Bình Thạnh, TP.HCM"}]
[{"$f":"\"Tên kho: \"&tt_Tên_Kho","v":"Tên kho: Trạm Trộn BTNN Núi Nhọn"}]
[]
["BÁO CÁO NHẬP XUẤT TỒN"]
[{"$f":"'Thông tin'!C12","v":"2014-01-01"}]
[{"$f":"'Thông tin'!C13","v":"2014-11-30"}]
[]
["Mã hàng","Tên hàng","ĐVT","Tồn \nđầu kỳ","Nhập \ntrong kỳ","Xuất \ntrong kỳ","Tồn \ncuối kỳ"]
[]
[{"$f":"_xll.TDbArray(\"SELECT mavt, tenvt, dvt, sldauky, slnhap, slxuat, slton FROM tbvattu WHERE mavt<>''\",\"write:2\")","v":"ND-001"},"Nhựa đường Puma","Tấn",2,52880,44993,7887]
["FO-001","Dầu FO","Lít",2,29942,18999,10943]
["BK-001","Bột Khoáng Holeim","Tấn",2,40,69.5,-29.5]
["CA-001","Cát","M3",2,311,183,128]
[]
[{"$f":"IF('Vật tư'!$B4998=\"\",\"\",'Vật tư'!$B4998)","v":""},{"$f":"IF($A16=\"\",\"\",VLOOKUP(A16,'Vật tư'!$B$9:$C$65534,2,0))","v":""},{"$f":"IF(A16=\"\",\"\",VLOOKUP($A16,'Vật tư'!$B$9:$D$65534,3,0))","v":""},{"$f":"IF($A16=\"\",\"\",VLOOKUP($A16,'Vật tư'!$B$9:$E$65534,4,0))","v":""},{"$f":"IF($A16=\"\",\"\",SUMIF('Nhập liệu'!$E$10:$E$61538,A16,'Nhập liệu'!$H$10:$H$61538))","v":""},{"$f":"IF($A16=\"\",\"\",SUMIF('Nhập liệu'!$E$10:$E$61538,A16,'Nhập liệu'!$I$10:$I$61538))","v":""},{"$f":"IF($A16=\"\",\"\",D16+E16-F16)","v":""}]
["CỘNG",null,null,{"$f":"SUBTOTAL(9,D10:D16)","v":8},{"$f":"SUBTOTAL(9,E10:E16)","v":83173},{"$f":"SUBTOTAL(9,F10:F16)","v":64244.5},{"$f":"SUBTOTAL(9,G10:G16)","v":18928.5}]
[]
[null,null,null,{"$f":"\"Bình Thuận,\"&\" \"&\"ngày\"&\" \"&DAY(NOW())&\" \"&\"tháng\"&\" \"&MONTH(NOW())&\" \"&\"năm\"&\" \"&YEAR(NOW())","v":"Bình Thuận, ngày 11 tháng 8 năm 2025"}]
["Người lập biểu - Thủ kho",null,null,null,"Trạm BTNN"]
[]
[]
[]
[]
[{"$f":"IF(tt_Người_lập_biểu=\"\",\"\",tt_Người_lập_biểu)","v":"Nguyễn Phi Long"},null,null,null,{"$f":"IF(tt_Thủ_kho=\"\",\"\",tt_Thủ_kho)","v":"Nguyễn Phi Long"}]

{"sheet":"Chi tiết N-X-T","index":5,"n_rows":69,"n_cols":7,"rows_kept":69,"cut":false,"hidden":false,"merged":[[10,6,11,6],[4,0,4,5],[10,0,10,1],[10,2,11,2],[10,3,11,3],[10,4,11,4],[10,5,11,5],[9,3,9,6],[68,0,68,1],[68,3,68,5],[58,0,58,2],[62,3,62,5],[62,0,62,1],[60,2,60,5]]}
[{"$f":"tt_Tên_Công_ty","v":"TỔNG CÔNG TY XD CTGT 6 - CÔNG TY CỔ PHẦN"}]
[{"$f":"tt_Địa_chỉ","v":"127 Đinh Tiên Hoàng, F3, Q.Bình Thạnh, TP.HCM"}]
[{"$f":"\"Tên kho: \"&tt_Tên_Kho","v":"Tên kho: Trạm Trộn BTNN Núi Nhọn"}]
[]
["SỔ CHI TIẾT VẬT TƯ CÔNG CỤ DỤNG CỤ"]
[]
[{"$f":"'Thông tin'!C12","v":"2014-01-01"}]
[{"$f":"'Thông tin'!C13","v":"2014-11-30"}]
[null,null,"Mã vật tư, công cụ dụng cụ:","FO-001"]
[null,null,"Tên vật tư, công cụ dụng cụ:",{"$f":"_xll.TDbScalar(\"SELECT tenvt FROM tbvattu WHERE mavt=@mavt\",,D9)","v":"Dầu FO"}]
["Chứng từ",null,"Diễn giải","Số lượng \nnhập trong kỳ","Số lượng \nxuất trong kỳ","Số lượng \ntồn cuối kỳ","Ghi Chú"]
["Số \nchứng từ","Ngày tháng\nchứng từ"]
[null,null,"Số dư đầu kỳ:",null,null,{"$f":"_xll.TDbScalar(\"SELECT sldauky FROM tbvattu WHERE mavt=@mavt\",,D9)","v":2}]
[{"$f":"_xll.TDbArray(\"SELECT ct_so, ct_ngay, diengiai, slnhap, slxuat FROM tbnhaplieu WHERE mvt=@mavt\",,D9)","v":"PN0001"},"2014-07-17","Nhập dầu FO",20000,"",{"$f":"IF(SUM(D14:E14)=0,\"-\",$F$13+SUM(D14:$D$14)-SUM(E14:$E$14))","v":20002}]
["PX0001","2014-10-24","Xuất dầu FO","",11984,{"$f":"IF(SUM(D15:E15)=0,\"-\",$F$13+SUM(D$14:$D15)-SUM(E$14:$E15))","v":8018}]
["PX0003","2014-11-19","Xuất Dầu FO","",3243,{"$f":"IF(SUM(D16:E16)=0,\"-\",$F$13+SUM(D$14:$D16)-SUM(E$14:$E16))","v":4775}]
["PN0011","2014-11-22","Nhập Dầu FO",9942,"",{"$f":"IF(SUM(D17:E17)=0,\"-\",$F$13+SUM(D$14:$D17)-SUM(E$14:$E17))","v":14717}]
["PX0004","2014-11-26","Xuất dầu FO","",3772,{"$f":"IF(SUM(D18:E18)=0,\"-\",$F$13+SUM(D$14:$D18)-SUM(E$14:$E18))","v":10945}]
[null,null,null,null,null,{"$f":"IF(SUM(D19:E19)=0,\"-\",$F$13+SUM(D$14:$D19)-SUM(E$14:$E19))","v":"-"}]
[null,null,null,null,null,{"$f":"IF(SUM(D20:E20)=0,\"-\",$F$13+SUM(D$14:$D20)-SUM(E$14:$E20))","v":"-"}]
[null,null,null,null,null,{"$f":"IF(SUM(D21:E21)=0,\"-\",$F$13+SUM(D$14:$D21)-SUM(E$14:$E21))","v":"-"}]
[null,null,null,null,null,{"$f":"IF(SUM(D22:E22)=0,\"-\",$F$13+SUM(D$14:$D22)-SUM(E$14:$E22))","v":"-"}]
[null,null,null,null,null,{"$f":"IF(SUM(D23:E23)=0,\"-\",$F$13+SUM(D$14:$D23)-SUM(E$14:$E23))","v":"-"}]
[null,null,null,null,null,{"$f":"IF(SUM(D24:E24)=0,\"-\",$F$13+SUM(D$14:$D24)-SUM(E$14:$E24))","v":"-"}]
[null,null,null,null,null,{"$f":"IF(SUM(D25:E25)=0,\"-\",$F$13+SUM(D$14:$D25)-SUM(E$14:$E25))","v":"-"}]
[null,null,null,null,null,{"$f":"IF(SUM(D26:E26)=0,\"-\",$F$13+SUM(D$14:$D26)-SUM(E$14:$E26))","v":"-"}]
[null,null,null,null,null,{"$f":"IF(SUM(D27:E27)=0,\"-\",$F$13+SUM(D$14:$D27)-SUM(E$14:$E27))","v":"-"}]
[null,null,null,null,null,{"$f":"IF(SUM(D28:E28)=0,\"-\",$F$13+SUM(D$14:$D28)-SUM(E$14:$E28))","v":"-"}]
[null,null,null,null,null,{"$f":"IF(SUM(D29:E29)=0,\"-\",$F$13+SUM(D$14:$D29)-SUM(E$14:$E29))","v":"-"}]
[null,null,null,null,null,{"$f":"IF(SUM(D30:E30)=0,\"-\",$F$13+SUM(D$14:$D30)-SUM(E$14:$E30))","v":"-"}]
[null,null,null,null,null,{"$f":"IF(SUM(D31:E31)=0,\"-\",$F$13+SUM(D$14:$D31)-SUM(E$14:$E31))","v":"-"}]
[null,null,null,null,null,{"$f":"IF(SUM(D32:E32)=0,\"-\",$F$13+SUM(D$14:$D32)-SUM(E$14:$E32))","v":"-"}]
[null,null,null,null,null,{"$f":"IF(SUM(D33:E33)=0,\"-\",$F$13+SUM(D$14:$D33)-SUM(E$14:$E33))","v":"-"}]
[null,null,null,null,null,{"$f":"IF(SUM(D34:E34)=0,\"-\",$F$13+SUM(D$14:$D34)-SUM(E$14:$E34))","v":"-"}]
[null,null,null,null,null,{"$f":"IF(SUM(D35:E35)=0,\"-\",$F$13+SUM(D$14:$D35)-SUM(E$14:$E35))","v":"-"}]
[null,null,null,null,null,{"$f":"IF(SUM(D36:E36)=0,\"-\",$F$13+SUM(D$14:$D36)-SUM(E$14:$E36))","v":"-"}]
[null,null,null,null,null,{"$f":"IF(SUM(D37:E37)=0,\"-\",$F$13+SUM(D$14:$D37)-SUM(E$14:$E37))","v":"-"}]
[null,null,null,null,null,{"$f":"IF(SUM(D38:E38)=0,\"-\",$F$13+SUM(D$14:$D38)-SUM(E$14:$E38))","v":"-"}]
[null,null,null,null,null,{"$f":"IF(SUM(D39:E39)=0,\"-\",$F$13+SUM(D$14:$D39)-SUM(E$14:$E39))","v":"-"}]
[null,null,null,null,null,{"$f":"IF(SUM(D40:E40)=0,\"-\",$F$13+SUM(D$14:$D40)-SUM(E$14:$E40))","v":"-"}]
[null,null,null,null,null,{"$f":"IF(SUM(D41:E41)=0,\"-\",$F$13+SUM(D$14:$D41)-SUM(E$14:$E41))","v":"-"}]
[null,null,null,null,null,{"$f":"IF(SUM(D42:E42)=0,\"-\",$F$13+SUM(D$14:$D42)-SUM(E$14:$E42))","v":"-"}]
[null,null,null,null,null,{"$f":"IF(SUM(D43:E43)=0,\"-\",$F$13+SUM(D$14:$D43)-SUM(E$14:$E43))","v":"-"}]
[null,null,null,null,null,{"$f":"IF(SUM(D44:E44)=0,\"-\",$F$13+SUM(D$14:$D44)-SUM(E$14:$E44))","v":"-"}]
[null,null,null,null,null,{"$f":"IF(SUM(D45:E45)=0,\"-\",$F$13+SUM(D$14:$D45)-SUM(E$14:$E45))","v":"-"}]
[null,null,null,null,null,{"$f":"IF(SUM(D46:E46)=0,\"-\",$F$13+SUM(D$14:$D46)-SUM(E$14:$E46))","v":"-"}]
[null,null,null,null,null,{"$f":"IF(SUM(D47:E47)=0,\"-\",$F$13+SUM(D$14:$D47)-SUM(E$14:$E47))","v":"-"}]
[null,null,null,null,null,{"$f":"IF(SUM(D48:E48)=0,\"-\",$F$13+SUM(D$14:$D48)-SUM(E$14:$E48))","v":"-"}]
[null,null,null,null,null,{"$f":"IF(SUM(D49:E49)=0,\"-\",$F$13+SUM(D$14:$D49)-SUM(E$14:$E49))","v":"-"}]
[{"$f":"IF($G50=\"\",\"\",INDEX('Nhập liệu'!$B$10:$B$46002,$G50))","v":""},{"$f":"IF($G50=\"\",\"\",INDEX('Nhập liệu'!$A$10:$A$46002,$G50))","v":""},{"$f":"IF($G50=\"\",\"\",INDEX('Nhập liệu'!$D$10:$D$46002,$G50))","v":""},{"$f":"IF($G50=\"\",\"\",INDEX('Nhập liệu'!$H$10:$H$46002,$G50))","v":""},{"$f":"IF($G50=\"\",\"\",INDEX('Nhập liệu'!$I$10:$I$46002,$G50))","v":""},{"$f":"IF(SUM(D50:E50)=0,\"-\",$F$13+SUM(D$14:$D50)-SUM(E$14:$E50))","v":"-"}]
[{"$f":"IF($G51=\"\",\"\",INDEX('Nhập liệu'!$B$10:$B$46002,$G51))","v":""},{"$f":"IF($G51=\"\",\"\",INDEX('Nhập liệu'!$A$10:$A$46002,$G51))","v":""},{"$f":"IF($G51=\"\",\"\",INDEX('Nhập liệu'!$D$10:$D$46002,$G51))","v":""},{"$f":"IF($G51=\"\",\"\",INDEX('Nhập liệu'!$H$10:$H$46002,$G51))","v":""},{"$f":"IF($G51=\"\",\"\",INDEX('Nhập liệu'!$I$10:$I$46002,$G51))","v":""},{"$f":"IF(SUM(D51:E51)=0,\"-\",$F$13+SUM(D$14:$D51)-SUM(E$14:$E51))","v":"-"}]
[{"$f":"IF($G52=\"\",\"\",INDEX('Nhập liệu'!$B$10:$B$46002,$G52))","v":""},{"$f":"IF($G52=\"\",\"\",INDEX('Nhập liệu'!$A$10:$A$46002,$G52))","v":""},{"$f":"IF($G52=\"\",\"\",INDEX('Nhập liệu'!$D$10:$D$46002,$G52))","v":""},{"$f":"IF($G52=\"\",\"\",INDEX('Nhập liệu'!$H$10:$H$46002,$G52))","v":""},{"$f":"IF($G52=\"\",\"\",INDEX('Nhập liệu'!$I$10:$I$46002,$G52))","v":""},{"$f":"IF(SUM(D52:E52)=0,\"-\",$F$13+SUM(D$14:$D52)-SUM(E$14:$E52))","v":"-"}]
[{"$f":"IF($G53=\"\",\"\",INDEX('Nhập liệu'!$B$10:$B$46002,$G53))","v":""},{"$f":"IF($G53=\"\",\"\",INDEX('Nhập liệu'!$A$10:$A$46002,$G53))","v":""},{"$f":"IF($G53=\"\",\"\",INDEX('Nhập liệu'!$D$10:$D$46002,$G53))","v":""},{"$f":"IF($G53=\"\",\"\",INDEX('Nhập liệu'!$H$10:$H$46002,$G53))","v":""},{"$f":"IF($G53=\"\",\"\",INDEX('Nhập liệu'!$I$10:$I$46002,$G53))","v":""},{"$f":"IF(SUM(D53:E53)=0,\"-\",$F$13+SUM(D$14:$D53)-SUM(E$14:$E53))","v":"-"}]
[{"$f":"IF($G54=\"\",\"\",INDEX('Nhập liệu'!$B$10:$B$46002,$G54))","v":""},{"$f":"IF($G54=\"\",\"\",INDEX('Nhập liệu'!$A$10:$A$46002,$G54))","v":""},{"$f":"IF($G54=\"\",\"\",INDEX('Nhập liệu'!$D$10:$D$46002,$G54))","v":""},{"$f":"IF($G54=\"\",\"\",INDEX('Nhập liệu'!$H$10:$H$46002,$G54))","v":""},{"$f":"IF($G54=\"\",\"\",INDEX('Nhập liệu'!$I$10:$I$46002,$G54))","v":""},{"$f":"IF(SUM(D54:E54)=0,\"-\",$F$13+SUM(D$14:$D54)-SUM(E$14:$E54))","v":"-"}]
[{"$f":"IF($G55=\"\",\"\",INDEX('Nhập liệu'!$B$10:$B$46002,$G55))","v":""},{"$f":"IF($G55=\"\",\"\",INDEX('Nhập liệu'!$A$10:$A$46002,$G55))","v":""},{"$f":"IF($G55=\"\",\"\",INDEX('Nhập liệu'!$D$10:$D$46002,$G55))","v":""},{"$f":"IF($G55=\"\",\"\",INDEX('Nhập liệu'!$H$10:$H$46002,$G55))","v":""},{"$f":"IF($G55=\"\",\"\",INDEX('Nhập liệu'!$I$10:$I$46002,$G55))","v":""},{"$f":"IF(SUM(D55:E55)=0,\"-\",$F$13+SUM(D$14:$D55)-SUM(E$14:$E55))","v":"-"}]
[{"$f":"IF($G56=\"\",\"\",INDEX('Nhập liệu'!$B$10:$B$46002,$G56))","v":""},{"$f":"IF($G56=\"\",\"\",INDEX('Nhập liệu'!$A$10:$A$46002,$G56))","v":""},{"$f":"IF($G56=\"\",\"\",INDEX('Nhập liệu'!$D$10:$D$46002,$G56))","v":""},{"$f":"IF($G56=\"\",\"\",INDEX('Nhập liệu'!$H$10:$H$46002,$G56))","v":""},{"$f":"IF($G56=\"\",\"\",INDEX('Nhập liệu'!$I$10:$I$46002,$G56))","v":""},{"$f":"IF(SUM(D56:E56)=0,\"-\",$F$13+SUM(D$14:$D56)-SUM(E$14:$E56))","v":"-"}]
[{"$f":"IF($G57=\"\",\"\",INDEX('Nhập liệu'!$B$10:$B$46002,$G57))","v":""},{"$f":"IF($G57=\"\",\"\",INDEX('Nhập liệu'!$A$10:$A$46002,$G57))","v":""},{"$f":"IF($G57=\"\",\"\",INDEX('Nhập liệu'!$D$10:$D$46002,$G57))","v":""},{"$f":"IF($G57=\"\",\"\",INDEX('Nhập liệu'!$H$10:$H$46002,$G57))","v":""},{"$f":"IF($G57=\"\",\"\",INDEX('Nhập liệu'!$I$10:$I$46002,$G57))","v":""},{"$f":"IF(SUM(D57:E57)=0,\"-\",$F$13+SUM(D$14:$D57)-SUM(E$14:$E57))","v":"-"}]
[{"$f":"IF($G58=\"\",\"\",INDEX('Nhập liệu'!$B$10:$B$46002,$G58))","v":""},{"$f":"IF($G58=\"\",\"\",INDEX('Nhập liệu'!$A$10:$A$46002,$G58))","v":""},{"$f":"IF($G58=\"\",\"\",INDEX('Nhập liệu'!$D$10:$D$46002,$G58))","v":""},{"$f":"IF($G58=\"\",\"\",INDEX('Nhập liệu'!$H$10:$H$46002,$G58))","v":""},{"$f":"IF($G58=\"\",\"\",INDEX('Nhập liệu'!$I$10:$I$46002,$G58))","v":""},{"$f":"IF(SUM(D58:E58)=0,\"-\",$F$13+SUM(D$14:$D58)-SUM(E$14:$E58))","v":"-"}]
["CỘNG",null,null,{"$f":"SUM(D14:D58)","v":29942},{"$f":"SUM(E14:E58)","v":18999},{"$f":"F13+D59-E59","v":10945}]
[]
[null,null,{"$f":"\"Bình Thuận,\"&\" \"&\"ngày\"&\" \"&DAY(NOW())&\" \"&\"tháng\"&\" \"&MONTH(NOW())&\" \"&\"năm\"&\" \"&YEAR(NOW())","v":"Bình Thuận, ngày 11 tháng 8 năm 2025"}]
[]
["Người lập biểu",null,null,"Thủ kho"]
[]
[]
[]
[]
[]
[{"$f":"IF(tt_Người_lập_biểu=\"\",\"\",tt_Người_lập_biểu)","v":"Nguyễn Phi Long"},null,null,{"$f":"IF(tt_Thủ_kho=\"\",\"\",tt_Thủ_kho)","v":"Nguyễn Phi Long"}]

{"sheet":"Phiếu Nhập-Xuất ","index":6,"n_rows":17,"n_cols":16,"rows_kept":17,"cut":false,"hidden":false,"merged":[[0,4,0,5],[1,4,1,5],[2,4,2,5]]}
[{"$f":"tt_Tên_Công_ty","v":"TỔNG CÔNG TY XD CTGT 6 - CÔNG TY CỔ PHẦN"},null,null,null,{"$f":"IF(LEFT($F$5,2)=\"PN\",\"Mẫu số : 01-VT\",\"Mẫu số : 02-VT\")","v":"Mẫu số : 02-VT"},null,null,null,null,"Người lập phiếu",null,{"$f":"IF(LEFT($F$5,2)=\"PN\",\"Người giao hàng\",\"Người nhận hàng\")","v":"Người nhận hàng"},null,"Thủ kho",null,"Thủ trưởng đơn vị"]
[{"$f":"tt_Địa_chỉ","v":"127 Đinh Tiên Hoàng, F3, Q.Bình Thạnh, TP.HCM"},null,null,null,"(Ban hành theo QĐ số 15/2006/QĐ-BTC",null,null,null,null,"(Ký, họ tên)",null,"(Ký, họ tên)",null,"(Ký, họ tên)",null,"(Ký, họ tên)"]
[null,null,null,null,"ngày 20/03/2006 của Bộ trưởng BTC)"]
[{"$f":"IF(LEFT($F$5,2)=\"PN\",\"  PHIẾU NHẬP KHO\",\"  PHIẾU XUẤT KHO\")","v":"  PHIẾU XUẤT KHO"}]
[null,"Liên : 1",null,null,"Số :","PX0001","2014-10-24"]
[{"$f":"SUBSTITUTE(IF($F$5=\"\",\"\",TDateToText(G5)),\"ngày\",\"Ngày\")","v":{"$error":"#NAME?"}},null,null,null,null,null,null,null,null,{"$f":"IF(tt_Người_lập_biểu=\"\",\"\",tt_Người_lập_biểu)","v":"Nguyễn Phi Long"},null,null,null,{"$f":"IF(tt_Thủ_kho=\"\",\"\",tt_Thủ_kho)","v":"Nguyễn Phi Long"},null,{"$f":"IF(tt_Thủ_trưởng=\"\",\"\",tt_Thủ_trưởng)","v":"Ngô Ngọc Trung"}]
[]
[null,null,null,null,null,null,null,"- Khách hàng:",null,{"$f":"_xll.TDbScalar(\"SELECT ncc_ten FROM tbnhaplieu WHERE ct_so=@ct_so\",,F5)","v":"Như Ý"},null,"- Địa chỉ:",{"$f":"_xll.TDbScalar(\"SELECT ncc_diachi FROM tbnhaplieu WHERE ct_so=@ct_so\",,F5)","v":"130 Đinh Tiên Hoàng, F3, Q.Bình Thạnh, TP.HCM"}]
[null,null,null,null,null,null,null,{"$f":"IF(LEFT($F$5,2)=\"PN\",\"- Nhập tại kho: \"&tt_Tên_Kho,\"- Xuất tại kho: \"&tt_Tên_Kho)","v":"- Xuất tại kho: Trạm Trộn BTNN Núi Nhọn"},null,null,null,{"$f":"IF(LEFT($F$5,2)=\"PN\",\" Địa điểm :\"&tt_Địa_chỉ,\"- Địa điểm :\"&\"\")","v":"- Địa điểm :"},{"$f":"tt_Địa_chỉ","v":"127 Đinh Tiên Hoàng, F3, Q.Bình Thạnh, TP.HCM"}]
[]
["Số \nTT","Tên, nhãn hiệu, quy cách\nphẩm chất, vật tư \n(sản phẩm hàng hóa)","Mã \nhàng","Đơn \nvị\ntính",{"$f":"IF(LEFT(F5,2)=\"PN\",\"Số lượng nhập theo hóa đơn\",\"Số lượng xuất theo hóa đơn\")","v":"Số lượng xuất theo hóa đơn"},"Ghi \nchú"]
[]
[{"$f":"_xll.TDbArray(\"SELECT tenvt, mvt, dvt, IIF(ct_so LIKE 'PN%', slnhap , slxuat), diengiai FROM tbnhaplieu WHERE  ct_so = @ct_so\",\"write:2, stt:true,\",F5)","v":1},"Cát","CA-001","M3",12,"Xuất Cát"]
[2,"Bột Khoáng Holeim","BK-001","Tấn",9.5,"Xuất Bột đá Holeim"]
[3,"Nhựa đường Puma","ND-001","Tấn",10082,"Xuất Nhựa đường"]
[4,"Dầu FO","FO-001","Lít",11984,"Xuất dầu FO"]
[5,"Bột Khoáng Holeim","BK-001","Tấn",11,"Xuất Bột đá Holeim"]